{"text_format":"1","workbook":"xlsx","n_sheets":4,"sheets":["HFVsf-_-4 - Kühlen","HFVsf-_-4 - Heizen","Hinterlegte Gleichungen","Legende"],"not_rendered":{"charts":21,"images":7,"macros":1,"external_links":3,"defined_names":187,"comments":0,"pivot_tables":0},"unopened":[],"bounds":{"document_bytes":16777216,"sheet_cells":100000,"rows_first":2000,"rows_last":500,"rows_between":2000,"halvings":0,"cell_chars":16384,"cell_head_chars":4096},"cells_cut":0,"cells_raw":0,"read":"whole","date_system":"1900"}

{"sheet":"HFVsf-_-4 - Kühlen","index":0,"n_rows":61,"n_cols":34,"rows_kept":61,"cut":false,"hidden":false,"merged":[[24,4,24,10],[24,13,24,19],[24,22,24,28],[40,2,47,3],[40,29,47,30],[31,4,31,5],[31,22,31,23],[31,13,31,14],[4,25,4,26],[5,25,5,27],[6,25,6,27],[7,25,7,27],[10,12,14,12],[18,4,18,5],[21,4,21,5],[22,4,22,5],[17,4,17,5],[9,4,9,5],[10,4,10,5],[12,4,12,5],[13,4,13,5],[14,4,14,5]]}
[null,"Tel.  +49 (0)711 8201-180   Fax: -720",null,null,null,null,null,null,null,null,null,null,null,null,null,null,null,null,null,null,null,null,null,null,null,"eMail:",null,null,null,"Raumluft@LTG-AG.de"]
[null,{"$f":"IF(Sprache=\"Deutsch\",VLOOKUP(\"Induktionsgerät HFVsf - System smart flow, 4-Leiter-System\",Legende!$B$3:$E$83,1,FALSE),IF(Sprache=\"English\",VLOOKUP(\"Induktionsgerät HFVsf - System smart flow, 4-Leiter-System\",Legende!$B$3:$E$83,2,FALSE),IF(Sprache=\"Francais\",VLOOKUP(\"Induktionsgerät HFVsf - System smart flow, 4-Leiter-System\",Legende!$B$3:$E$83,3,FALSE),0)))","v":"Induktionsgerät HFVsf - System smart flow, 4-Leiter-System"},null,null,null,null,null,null,null,null,null,null,null,null,null,null,null,null,null,null,null,{"$f":"IF(Sprache=\"Deutsch\",VLOOKUP(\"Sprache:\",Legende!$B$3:$E$83,1,FALSE),IF(Sprache=\"English\",VLOOKUP(\"Sprache:\",Legende!$B$3:$E$83,2,FALSE),IF(Sprache=\"Francais\",VLOOKUP(\"Sprache:\",Legende!$B$3:$E$83,3,FALSE),0)))","v":"Sprache:"},null,null,null,null,null,null,null,"LTG Aktiengesellschaft"]
[null,null,null,null,null,null,null,null,null,null,null,null,null,null,null,null,null,null,null,null,null,null,null,null,null,null,null,null,null,null,null,null,null,"Deutsch"]
[null,null,null,null,null,null,null,null,null,null,null,null,null,null,null,null,null,null,null,null,null,null,null,null,null,null,null,null,null,null,null,null,null,{"$f":"Legende!B5","v":"Deutsch"}]
[null,null,"Foto",null,null,null,"Foto",null,null,null,null,null,null,null,null,null,null,null,null,null,null,null,null,null,{"$f":"IF(Sprache=\"Deutsch\",VLOOKUP(\"Datum:\",Legende!$B$3:$E$83,1,FALSE),IF(Sprache=\"English\",VLOOKUP(\"Datum:\",Legende!$B$3:$E$83,2,FALSE),IF(Sprache=\"Francais\",VLOOKUP(\"Datum:\",Legende!$B$3:$E$83,3,FALSE),0)))","v":"Datum:"},{"$f":"TODAY()","v":"2026-06-23"},null,null,null,null,null,null,null,{"$f":"Legende!C5","v":"English"}]
[null,null,null,null,null,null,null,null,null,null,null,null,null,null,null,null,null,null,null,null,null,null,null,null,{"$f":"IF(Sprache=\"Deutsch\",VLOOKUP(\"Bearbeiter:\",Legende!$B$3:$E$83,1,FALSE),IF(Sprache=\"English\",VLOOKUP(\"Bearbeiter:\",Legende!$B$3:$E$83,2,FALSE),IF(Sprache=\"Francais\",VLOOKUP(\"Bearbeiter:\",Legende!$B$3:$E$83,3,FALSE),0)))","v":"Bearbeiter:"}]
[null,null,null,null,null,null,null,null,null,null,null,null,null,null,null,null,null,null,null,null,null,null,null,null,{"$f":"IF(Sprache=\"Deutsch\",VLOOKUP(\"Projekt:\",Legende!$B$3:$E$83,1,FALSE),IF(Sprache=\"English\",VLOOKUP(\"Projekt:\",Legende!$B$3:$E$83,2,FALSE),IF(Sprache=\"Francais\",VLOOKUP(\"Projekt:\",Legende!$B$3:$E$83,3,FALSE),0)))","v":"Projekt:"}]
[null,null,null,null,null,null,null,null,null,null,null,null,null,null,null,null,null,null,null,null,null,null,null,null,{"$f":"IF(Sprache=\"Deutsch\",VLOOKUP(\"Variante:\",Legende!$B$3:$E$83,1,FALSE),IF(Sprache=\"English\",VLOOKUP(\"Variante:\",Legende!$B$3:$E$83,2,FALSE),IF(Sprache=\"Francais\",VLOOKUP(\"Variante:\",Legende!$B$3:$E$83,3,FALSE),0)))","v":"Variante:"}]
[]
[null,{"$f":"IF(Sprache=\"Deutsch\",VLOOKUP(\"Auslegunsbedingungen:\",Legende!$B$3:$E$83,1,FALSE),IF(Sprache=\"English\",VLOOKUP(\"Auslegunsbedingungen:\",Legende!$B$3:$E$83,2,FALSE),IF(Sprache=\"Francais\",VLOOKUP(\"Auslegunsbedingungen:\",Legende!$B$3:$E$83,3,FALSE),0)))","v":"Auslegunsbedingungen:"},null,null,{"$f":"IF(Sprache=\"Deutsch\",VLOOKUP(\"Kühlen\",Legende!$B$3:$E$83,1,FALSE),IF(Sprache=\"English\",VLOOKUP(\"Kühlen\",Legende!$B$3:$E$83,2,FALSE),IF(Sprache=\"Francais\",VLOOKUP(\"Kühlen\",Legende!$B$3:$E$83,3,FALSE),0)))","v":"Kühlen"},null,null,null,{"$f":"IF(Sprache=\"Deutsch\",VLOOKUP(\"Bemerkungen:\",Legende!$B$3:$E$83,1,FALSE),IF(Sprache=\"English\",VLOOKUP(\"Bemerkungen:\",Legende!$B$3:$E$83,2,FALSE),IF(Sprache=\"Francais\",VLOOKUP(\"Bemerkungen:\",Legende!$B$3:$E$83,3,FALSE),0)))","v":"Bemerkungen:"},null,null,null,null,null,null,null,null,null,null,null,{"$f":"IF(Sprache=\"Deutsch\",VLOOKUP(\"Betriebszustände (Stellung Düsenklappe)\",Legende!$B$3:$E$83,1,FALSE),IF(Sprache=\"English\",VLOOKUP(\"Betriebszustände (Stellung Düsenklappe)\",Legende!$B$3:$E$83,2,FALSE),IF(Sprache=\"Francais\",VLOOKUP(\"Betriebszustände (Stellung Düsenklappe)\",Legende!$B$3:$E$83,3,FALSE),0)))","v":"Betriebszustände (Stellung Düsenklappe)"}]
[null,{"$f":"IF(Sprache=\"Deutsch\",VLOOKUP(\"Raumlufttemperatur\",Legende!$B$3:$E$83,1,FALSE),IF(Sprache=\"English\",VLOOKUP(\"Raumlufttemperatur\",Legende!$B$3:$E$83,2,FALSE),IF(Sprache=\"Francais\",VLOOKUP(\"Raumlufttemperatur\",Legende!$B$3:$E$83,3,FALSE),0)))","v":"Raumlufttemperatur"},null,null,26,null,null,null,{"$f":"IF(Sprache=\"Deutsch\",VLOOKUP(\" => Ablufttemperatur\",Legende!$B$3:$E$83,1,FALSE),IF(Sprache=\"English\",VLOOKUP(\" => Ablufttemperatur\",Legende!$B$3:$E$83,2,FALSE),IF(Sprache=\"Francais\",VLOOKUP(\" => Ablufttemperatur\",Legende!$B$3:$E$83,3,FALSE),0)))","v":" => Ablufttemperatur"},null,null,null,{"$f":"IF(Sprache=\"Deutsch\",VLOOKUP(\"Sekundärleistung\",Legende!$B$3:$E$83,1,FALSE),IF(Sprache=\"English\",VLOOKUP(\"Sekundärleistung\",Legende!$B$3:$E$83,2,FALSE),IF(Sprache=\"Francais\",VLOOKUP(\"Sekundärleistung\",Legende!$B$3:$E$83,3,FALSE),0)))","v":"Sekundärleistung"},null,null,null,null,null,null,null,{"$f":"IF(Sprache=\"Deutsch\",VLOOKUP(\"V0 - geschlossen\",Legende!$B$3:$E$83,1,FALSE),IF(Sprache=\"English\",VLOOKUP(\"V0 - geschlossen\",Legende!$B$3:$E$83,2,FALSE),IF(Sprache=\"Francais\",VLOOKUP(\"V0 - geschlossen\",Legende!$B$3:$E$83,3,FALSE),0)))","v":"V0 - geschlossen"}]
[null,null,null,null,null,null,null,null,null,null,null,null,null,null,null,null,null,null,null,null,{"$f":"IF(Sprache=\"Deutsch\",VLOOKUP(\"V1 - geringe Primärluftmenge 1, geringe Induktion\",Legende!$B$3:$E$83,1,FALSE),IF(Sprache=\"English\",VLOOKUP(\"V1 - geringe Primärluftmenge 1, geringe Induktion\",Legende!$B$3:$E$83,2,FALSE),IF(Sprache=\"Francais\",VLOOKUP(\"V1 - geringe Primärluftmenge 1, geringe Induktion\",Legende!$B$3:$E$83,3,FALSE),0)))","v":"V1 - geringe Primärluftmenge 1, geringe Induktion"}]
[null,{"$f":"IF(Sprache=\"Deutsch\",VLOOKUP(\"relative Feuchte\",Legende!$B$3:$E$83,1,FALSE),IF(Sprache=\"English\",VLOOKUP(\"relative Feuchte\",Legende!$B$3:$E$83,2,FALSE),IF(Sprache=\"Francais\",VLOOKUP(\"relative Feuchte\",Legende!$B$3:$E$83,3,FALSE),0)))","v":"relative Feuchte"},null,null,50,null,null,null,{"$f":"IF(Sprache=\"Deutsch\",VLOOKUP(\"Bereich:\",Legende!$B$3:$E$83,1,FALSE),IF(Sprache=\"English\",VLOOKUP(\"Bereich:\",Legende!$B$3:$E$83,2,FALSE),IF(Sprache=\"Francais\",VLOOKUP(\"Bereich:\",Legende!$B$3:$E$83,3,FALSE),0)))","v":"Bereich:"},null,"30-70 %",null,null,null,null,null,null,null,null,null,{"$f":"IF(Sprache=\"Deutsch\",VLOOKUP(\"V2 - geringe Primärluftmenge 2, mittlere Induktion\",Legende!$B$3:$E$83,1,FALSE),IF(Sprache=\"English\",VLOOKUP(\"V2 - geringe Primärluftmenge 2, mittlere Induktion\",Legende!$B$3:$E$83,2,FALSE),IF(Sprache=\"Francais\",VLOOKUP(\"V2 - geringe Primärluftmenge 2, mittlere Induktion\",Legende!$B$3:$E$83,3,FALSE),0)))","v":"V2 - geringe Primärluftmenge 2, mittlere Induktion"}]
[null,{"$f":"IF(Sprache=\"Deutsch\",VLOOKUP(\"Taupunkttemperatur Raumluft\",Legende!$B$3:$E$83,1,FALSE),IF(Sprache=\"English\",VLOOKUP(\"Taupunkttemperatur Raumluft\",Legende!$B$3:$E$83,2,FALSE),IF(Sprache=\"Francais\",VLOOKUP(\"Taupunkttemperatur Raumluft\",Legende!$B$3:$E$83,3,FALSE),0)))","v":"Taupunkttemperatur Raumluft"},null,null,{"$f":"(241.2*LN(E13/100)+4222.03716*E11/(241.2+E11))/(17.5043-LN(E11/100)-17.5043*G18/(241.2+G18))","v":12.924250177222383},null,null,null,null,null,null,null,null,null,null,null,null,null,null,null,{"$f":"IF(Sprache=\"Deutsch\",VLOOKUP(\"V3 - mittlere Primärluftmenge 1, mittlere Induktion\",Legende!$B$3:$E$83,1,FALSE),IF(Sprache=\"English\",VLOOKUP(\"V3 - mittlere Primärluftmenge 1, mittlere Induktion\",Legende!$B$3:$E$83,2,FALSE),IF(Sprache=\"Francais\",VLOOKUP(\"V3 - mittlere Primärluftmenge 1, mittlere Induktion\",Legende!$B$3:$E$83,3,FALSE),0)))","v":"V3 - mittlere Primärluftmenge 1, mittlere Induktion"}]
[null,{"$f":"IF(Sprache=\"Deutsch\",VLOOKUP(\"Wassergehalt Raumluft\",Legende!$B$3:$E$83,1,FALSE),IF(Sprache=\"English\",VLOOKUP(\"Wassergehalt Raumluft\",Legende!$B$3:$E$83,2,FALSE),IF(Sprache=\"Francais\",VLOOKUP(\"Wassergehalt Raumluft\",Legende!$B$3:$E$83,3,FALSE),0)))","v":"Wassergehalt Raumluft"},null,null,{"$f":"(E13/100)*(0.0357*E11^2-0.4941*E11+10.356)","v":10.821300000000001},null,null,null,null,null,null,null,null,null,null,null,null,null,null,null,{"$f":"IF(Sprache=\"Deutsch\",VLOOKUP(\"V4 – mittlere Primärluftmenge 2,  mittlere Induktion\",Legende!$B$3:$E$83,1,FALSE),IF(Sprache=\"English\",VLOOKUP(\"V4 – mittlere Primärluftmenge 2,  mittlere Induktion\",Legende!$B$3:$E$83,2,FALSE),IF(Sprache=\"Francais\",VLOOKUP(\"V4 – mittlere Primärluftmenge 2,  mittlere Induktion\",Legende!$B$3:$E$83,3,FALSE),0)))","v":"V4 – mittlere Primärluftmenge 2,  mittlere Induktion"}]
[null,null,null,null,null,null,null,null,null,null,null,null,null,null,null,null,null,null,null,null,{"$f":"IF(Sprache=\"Deutsch\",VLOOKUP(\"V5 - Booststufe 1, hohe Induktion\",Legende!$B$3:$E$83,1,FALSE),IF(Sprache=\"English\",VLOOKUP(\"V5 - Booststufe 1, hohe Induktion\",Legende!$B$3:$E$83,2,FALSE),IF(Sprache=\"Francais\",VLOOKUP(\"V5 - Booststufe 1, hohe Induktion\",Legende!$B$3:$E$83,3,FALSE),0)))","v":"V5 - Booststufe 1, hohe Induktion"}]
[null,{"$f":"IF(Sprache=\"Deutsch\",VLOOKUP(\"Primärseite (Luftseite):\",Legende!$B$3:$E$83,1,FALSE),IF(Sprache=\"English\",VLOOKUP(\"Primärseite (Luftseite):\",Legende!$B$3:$E$83,2,FALSE),IF(Sprache=\"Francais\",VLOOKUP(\"Primärseite (Luftseite):\",Legende!$B$3:$E$83,3,FALSE),0)))","v":"Primärseite (Luftseite):"},null,null,null,null,null,null,null,null,null,null,null,null,null,null,null,null,null,null,{"$f":"IF(Sprache=\"Deutsch\",VLOOKUP(\"V6 - Booststufe 2, hohe Induktion\",Legende!$B$3:$E$83,1,FALSE),IF(Sprache=\"English\",VLOOKUP(\"V6 - Booststufe 2, hohe Induktion\",Legende!$B$3:$E$83,2,FALSE),IF(Sprache=\"Francais\",VLOOKUP(\"V6 - Booststufe 2, hohe Induktion\",Legende!$B$3:$E$83,3,FALSE),0)))","v":"V6 - Booststufe 2, hohe Induktion"}]
[null,{"$f":"IF(Sprache=\"Deutsch\",VLOOKUP(\"Primärdruck\",Legende!$B$3:$E$83,1,FALSE),IF(Sprache=\"English\",VLOOKUP(\"Primärdruck\",Legende!$B$3:$E$83,2,FALSE),IF(Sprache=\"Francais\",VLOOKUP(\"Primärdruck\",Legende!$B$3:$E$83,3,FALSE),0)))","v":"Primärdruck"},null,null,100,null,null,null,{"$f":"IF(Sprache=\"Deutsch\",VLOOKUP(\"Bereich:\",Legende!$B$3:$E$83,1,FALSE),IF(Sprache=\"English\",VLOOKUP(\"Bereich:\",Legende!$B$3:$E$83,2,FALSE),IF(Sprache=\"Francais\",VLOOKUP(\"Bereich:\",Legende!$B$3:$E$83,3,FALSE),0)))","v":"Bereich:"},null,"50 - 150 Pa"]
[null,{"$f":"IF(Sprache=\"Deutsch\",VLOOKUP(\"Primärlufttemperatur\",Legende!$B$3:$E$83,1,FALSE),IF(Sprache=\"English\",VLOOKUP(\"Primärlufttemperatur\",Legende!$B$3:$E$83,2,FALSE),IF(Sprache=\"Francais\",VLOOKUP(\"Primärlufttemperatur\",Legende!$B$3:$E$83,3,FALSE),0)))","v":"Primärlufttemperatur"},null,null,19,null,null,null,{"$f":"IF(Sprache=\"Deutsch\",VLOOKUP(\"Bereich:\",Legende!$B$3:$E$83,1,FALSE),IF(Sprache=\"English\",VLOOKUP(\"Bereich:\",Legende!$B$3:$E$83,2,FALSE),IF(Sprache=\"Francais\",VLOOKUP(\"Bereich:\",Legende!$B$3:$E$83,3,FALSE),0)))","v":"Bereich:"},null,"18 - 30 °C"]
[]
[null,{"$f":"IF(Sprache=\"Deutsch\",VLOOKUP(\"Sekundärseite (Wasserseite):\",Legende!$B$3:$E$83,1,FALSE),IF(Sprache=\"English\",VLOOKUP(\"Sekundärseite (Wasserseite):\",Legende!$B$3:$E$83,2,FALSE),IF(Sprache=\"Francais\",VLOOKUP(\"Sekundärseite (Wasserseite):\",Legende!$B$3:$E$83,3,FALSE),0)))","v":"Sekundärseite (Wasserseite):"},null,null,null,null,null,null,null,null,null,null,null,null,null,null,null,null,null,{"$f":"IF(Sprache=\"Deutsch\",VLOOKUP(\"Einstellung Düsenklappe (Primärluftmenge)\",Legende!$B$3:$E$83,1,FALSE),IF(Sprache=\"English\",VLOOKUP(\"Einstellung Düsenklappe (Primärluftmenge)\",Legende!$B$3:$E$83,2,FALSE),IF(Sprache=\"Francais\",VLOOKUP(\"Einstellung Düsenklappe (Primärluftmenge)\",Legende!$B$3:$E$83,3,FALSE),0)))","v":"Einstellung Düsenklappe (Primärluftmenge)"}]
[null,{"$f":"IF(Sprache=\"Deutsch\",VLOOKUP(\"Wasservorlauftemperatur\",Legende!$B$3:$E$83,1,FALSE),IF(Sprache=\"English\",VLOOKUP(\"Wasservorlauftemperatur\",Legende!$B$3:$E$83,2,FALSE),IF(Sprache=\"Francais\",VLOOKUP(\"Wasservorlauftemperatur\",Legende!$B$3:$E$83,3,FALSE),0)))","v":"Wasservorlauftemperatur"},null,null,16,null,null,null,{"$f":"IF(Sprache=\"Deutsch\",VLOOKUP(\"Bereich:\",Legende!$B$3:$E$83,1,FALSE),IF(Sprache=\"English\",VLOOKUP(\"Bereich:\",Legende!$B$3:$E$83,2,FALSE),IF(Sprache=\"Francais\",VLOOKUP(\"Bereich:\",Legende!$B$3:$E$83,3,FALSE),0)))","v":"Bereich:"},null,"6 - 32 °C"]
[null,{"$f":"IF(Sprache=\"Deutsch\",VLOOKUP(\"Wassermassenstrom\",Legende!$B$3:$E$83,1,FALSE),IF(Sprache=\"English\",VLOOKUP(\"Wassermassenstrom\",Legende!$B$3:$E$83,2,FALSE),IF(Sprache=\"Francais\",VLOOKUP(\"Wassermassenstrom\",Legende!$B$3:$E$83,3,FALSE),0)))","v":"Wassermassenstrom"},null,null,120,null,null,null,{"$f":"IF(Sprache=\"Deutsch\",VLOOKUP(\"Bereich:\",Legende!$B$3:$E$83,1,FALSE),IF(Sprache=\"English\",VLOOKUP(\"Bereich:\",Legende!$B$3:$E$83,2,FALSE),IF(Sprache=\"Francais\",VLOOKUP(\"Bereich:\",Legende!$B$3:$E$83,3,FALSE),0)))","v":"Bereich:"},null,"30 - 300 kg/h"]
[]
[null,{"$f":"IF(Sprache=\"Deutsch\",VLOOKUP(\"Geräte Baugröße\",Legende!$B$3:$E$83,1,FALSE),IF(Sprache=\"English\",VLOOKUP(\"Geräte Baugröße\",Legende!$B$3:$E$83,2,FALSE),IF(Sprache=\"Francais\",VLOOKUP(\"Geräte Baugröße\",Legende!$B$3:$E$83,3,FALSE),0)))","v":"Geräte Baugröße"},null,null,630,null,null,null,null,null,null,null,null,800,null,null,null,null,null,null,null,null,1000]
[null,{"$f":"IF(Sprache=\"Deutsch\",VLOOKUP(\"Einstellung Düsenklappe\",Legende!$B$3:$E$83,1,FALSE),IF(Sprache=\"English\",VLOOKUP(\"Einstellung Düsenklappe\",Legende!$B$3:$E$83,2,FALSE),IF(Sprache=\"Francais\",VLOOKUP(\"Einstellung Düsenklappe\",Legende!$B$3:$E$83,3,FALSE),0)))","v":"Einstellung Düsenklappe"},null,null,"V0","V1","V2","V3","V4","V5","V6",null,null,"V0","V1","V2","V3","V4","V5","V6",null,null,"V0","V1","V2","V3","V4","V5","V6"]
[null,{"$f":"IF(Sprache=\"Deutsch\",VLOOKUP(\"Primärvolumenstrom - Vp\",Legende!$B$3:$E$83,1,FALSE),IF(Sprache=\"English\",VLOOKUP(\"Primärvolumenstrom - Vp\",Legende!$B$3:$E$83,2,FALSE),IF(Sprache=\"Francais\",VLOOKUP(\"Primärvolumenstrom - Vp\",Legende!$B$3:$E$83,3,FALSE),0)))","v":"Primärvolumenstrom - Vp"},null,null,{"$f":"'Hinterlegte Gleichungen'!AB42","v":4.5924353658536585},{"$f":"'Hinterlegte Gleichungen'!AB43","v":12.422460365853659},{"$f":"'Hinterlegte Gleichungen'!AB44","v":20.158875285714281},{"$f":"'Hinterlegte Gleichungen'!AB46","v":36.607259999999997},{"$f":"'Hinterlegte Gleichungen'!AB47","v":52.383743124999995},{"$f":"'Hinterlegte Gleichungen'!AB48","v":58.409057317073163},{"$f":"'Hinterlegte Gleichungen'!AB49","v":64.2925731707317},"m³/h",null,{"$f":"'Hinterlegte Gleichungen'!G42","v":7.5315940000000001},{"$f":"'Hinterlegte Gleichungen'!G43","v":20.372835000000002},{"$f":"'Hinterlegte Gleichungen'!G44","v":32.564336999999995},{"$f":"'Hinterlegte Gleichungen'!G46","v":58.571615999999999},{"$f":"'Hinterlegte Gleichungen'!G47","v":83.813988999999992},{"$f":"'Hinterlegte Gleichungen'!G48","v":95.790853999999996},{"$f":"'Hinterlegte Gleichungen'!G49","v":105.43982},"m³/h",null,{"$f":"'Hinterlegte Gleichungen'!AW42","v":9.3685681463414632},{"$f":"'Hinterlegte Gleichungen'!AW43","v":25.341819146341468},{"$f":"'Hinterlegte Gleichungen'!AW44","v":40.317750571428562},{"$f":"'Hinterlegte Gleichungen'!AW46","v":72.299338500000005},{"$f":"'Hinterlegte Gleichungen'!AW47","v":103.45789267187499},{"$f":"'Hinterlegte Gleichungen'!AW48","v":119.15447692682926},{"$f":"'Hinterlegte Gleichungen'!AW49","v":131.15684926829269},"m³/h"]
[null,{"$f":"IF(Sprache=\"Deutsch\",VLOOKUP(\"Primärleistung - Qp\",Legende!$B$3:$E$83,1,FALSE),IF(Sprache=\"English\",VLOOKUP(\"Primärleistung - Qp\",Legende!$B$3:$E$83,2,FALSE),IF(Sprache=\"Francais\",VLOOKUP(\"Primärleistung - Qp\",Legende!$B$3:$E$83,3,FALSE),0)))","v":"Primärleistung - Qp"},null,null,{"$f":"'Hinterlegte Gleichungen'!AE42","v":10.715682520325203},{"$f":"'Hinterlegte Gleichungen'!AE43","v":28.985740853658541},{"$f":"'Hinterlegte Gleichungen'!AE44","v":47.037375666666655},{"$f":"'Hinterlegte Gleichungen'!AE46","v":85.416939999999997},{"$f":"'Hinterlegte Gleichungen'!AE47","v":122.22873395833331},{"$f":"'Hinterlegte Gleichungen'!AE48","v":136.28780040650403},{"$f":"'Hinterlegte Gleichungen'!AE49","v":150.01600406504062},"W",null,{"$f":"'Hinterlegte Gleichungen'!J42","v":17.573719333333333},{"$f":"'Hinterlegte Gleichungen'!J43","v":47.536615000000005},{"$f":"'Hinterlegte Gleichungen'!J44","v":75.983452999999983},{"$f":"'Hinterlegte Gleichungen'!J46","v":136.66710399999999},{"$f":"'Hinterlegte Gleichungen'!J47","v":195.56597433333332},{"$f":"'Hinterlegte Gleichungen'!J48","v":223.51199266666666},{"$f":"'Hinterlegte Gleichungen'!J49","v":246.02624666666665},"W",null,{"$f":"'Hinterlegte Gleichungen'!AZ42","v":21.859992341463414},{"$f":"'Hinterlegte Gleichungen'!AZ43","v":59.130911341463424},{"$f":"'Hinterlegte Gleichungen'!AZ44","v":94.07475133333331},{"$f":"'Hinterlegte Gleichungen'!AZ46","v":168.69845650000002},{"$f":"'Hinterlegte Gleichungen'!AZ47","v":241.40174956770829},{"$f":"'Hinterlegte Gleichungen'!AZ48","v":278.02711282926828},{"$f":"'Hinterlegte Gleichungen'!AZ49","v":306.03264829268295},"W"]
[]
[null,{"$f":"IF(Sprache=\"Deutsch\",VLOOKUP(\"Sekundärleistung - Qk\",Legende!$B$3:$E$83,1,FALSE),IF(Sprache=\"English\",VLOOKUP(\"Sekundärleistung - Qk\",Legende!$B$3:$E$83,2,FALSE),IF(Sprache=\"Francais\",VLOOKUP(\"Sekundärleistung - Qk\",Legende!$B$3:$E$83,3,FALSE),0)))","v":"Sekundärleistung - Qk"},null,null,{"$f":"'Hinterlegte Gleichungen'!AH42","v":0},{"$f":"'Hinterlegte Gleichungen'!AI43","v":133.82459424759938},{"$f":"'Hinterlegte Gleichungen'!AI44","v":198.41930309298448},{"$f":"'Hinterlegte Gleichungen'!AI46","v":198.41930309298448},{"$f":"'Hinterlegte Gleichungen'!AI47","v":198.41930309298448},{"$f":"'Hinterlegte Gleichungen'!AI48","v":232.27818192060025},{"$f":"'Hinterlegte Gleichungen'!AI49","v":253.1911586140221},"W",null,{"$f":"'Hinterlegte Gleichungen'!N42","v":0},{"$f":"'Hinterlegte Gleichungen'!N43","v":203.23883974870225},{"$f":"'Hinterlegte Gleichungen'!N44","v":301.33854820253009},{"$f":"'Hinterlegte Gleichungen'!N46","v":301.33854820253009},{"$f":"'Hinterlegte Gleichungen'!N47","v":301.33854820253009},{"$f":"'Hinterlegte Gleichungen'!N48","v":352.7598828742768},{"$f":"'Hinterlegte Gleichungen'!N49","v":384.52033126389676},"W",null,{"$f":"'Hinterlegte Gleichungen'!BD42","v":0},{"$f":"'Hinterlegte Gleichungen'!BD43","v":250.66914074023134},{"$f":"'Hinterlegte Gleichungen'!BD44","v":371.6625967912185},{"$f":"'Hinterlegte Gleichungen'!BD46","v":371.6625967912185},{"$f":"'Hinterlegte Gleichungen'!BD47","v":371.6625967912185},{"$f":"'Hinterlegte Gleichungen'!BD48","v":435.0842429382854},{"$f":"'Hinterlegte Gleichungen'!BD49","v":474.25669795325427},"W"]
[null,{"$f":"IF(Sprache=\"Deutsch\",VLOOKUP(\"Wasserrücklauftemperatur\",Legende!$B$3:$E$83,1,FALSE),IF(Sprache=\"English\",VLOOKUP(\"Wasserrücklauftemperatur\",Legende!$B$3:$E$83,2,FALSE),IF(Sprache=\"Francais\",VLOOKUP(\"Wasserrücklauftemperatur\",Legende!$B$3:$E$83,3,FALSE),0)))","v":"Wasserrücklauftemperatur"},null,null,{"$f":"'Hinterlegte Gleichungen'!AL42","v":16},{"$f":"'Hinterlegte Gleichungen'!AL43","v":16.95817131919522},{"$f":"'Hinterlegte Gleichungen'!AL44","v":17.420663267968862},{"$f":"'Hinterlegte Gleichungen'!AL46","v":17.420663267968862},{"$f":"'Hinterlegte Gleichungen'!AL47","v":17.420663267968862},{"$f":"'Hinterlegte Gleichungen'!AL48","v":17.663089608023391},{"$f":"'Hinterlegte Gleichungen'!AL49","v":17.812824524682735},"K",null,{"$f":"'Hinterlegte Gleichungen'!Q42","v":16},{"$f":"'Hinterlegte Gleichungen'!Q43","v":17.455170690324834},{"$f":"'Hinterlegte Gleichungen'!Q44","v":18.157555237726946},{"$f":"'Hinterlegte Gleichungen'!Q46","v":18.157555237726946},{"$f":"'Hinterlegte Gleichungen'!Q47","v":18.157555237726946},{"$f":"'Hinterlegte Gleichungen'!Q48","v":18.525727085018687},{"$f":"'Hinterlegte Gleichungen'!Q49","v":18.753128863464653},"K",null,{"$f":"'Hinterlegte Gleichungen'!BG42","v":16},{"$f":"'Hinterlegte Gleichungen'!BG43","v":17.794767117471821},{"$f":"'Hinterlegte Gleichungen'!BG44","v":18.661068712108964},{"$f":"'Hinterlegte Gleichungen'!BG46","v":18.661068712108964},{"$f":"'Hinterlegte Gleichungen'!BG47","v":18.661068712108964},{"$f":"'Hinterlegte Gleichungen'!BG48","v":19.115161643949538},{"$f":"'Hinterlegte Gleichungen'!BG49","v":19.395632682242869},"K"]
[null,{"$f":"IF(Sprache=\"Deutsch\",VLOOKUP(\"Wasserseitiger Druckverlust\",Legende!$B$3:$E$83,1,FALSE),IF(Sprache=\"English\",VLOOKUP(\"Wasserseitiger Druckverlust\",Legende!$B$3:$E$83,2,FALSE),IF(Sprache=\"Francais\",VLOOKUP(\"Wasserseitiger Druckverlust\",Legende!$B$3:$E$83,3,FALSE),0)))","v":"Wasserseitiger Druckverlust"},null,null,{"$f":" -0.0000002*E23*E23*E23 + 0.00036147*E23*E23 + 0.0098527*E23","v":6.0418920000000007},null,null,null,null,null,null,null,null,{"$f":" -0.0000003134*E23*E23*E23 + 0.0004811088*E23*E23 + 0.0098002421*E23","v":7.5624405719999999},null,null,null,null,null,null,null,null,{"$f":" -0.0000003531*E23*E23*E23 + 0.0005588302*E23*E23 + 0.0125670904*E23","v":8.9450489279999985}]
[]
[null,{"$f":"IF(Sprache=\"Deutsch\",VLOOKUP(\"Gesamt Kühlleistung - Q\",Legende!$B$3:$E$83,1,FALSE),IF(Sprache=\"English\",VLOOKUP(\"Gesamt Kühlleistung - Q\",Legende!$B$3:$E$83,2,FALSE),IF(Sprache=\"Francais\",VLOOKUP(\"Gesamt Kühlleistung - Q\",Legende!$B$3:$E$83,3,FALSE),0)))","v":"Gesamt Kühlleistung - Q"},null,null,{"$f":"'Hinterlegte Gleichungen'!AJ42","v":10.715682520325203},{"$f":"'Hinterlegte Gleichungen'!AJ43","v":162.81033510125792},{"$f":"'Hinterlegte Gleichungen'!AJ44","v":245.45667875965114},{"$f":"'Hinterlegte Gleichungen'!AJ46","v":283.83624309298449},{"$f":"'Hinterlegte Gleichungen'!AJ47","v":320.64803705131777},{"$f":"'Hinterlegte Gleichungen'!AJ48","v":368.56598232710428},{"$f":"'Hinterlegte Gleichungen'!AJ49","v":403.20716267906272},"W",null,{"$f":"'Hinterlegte Gleichungen'!O42","v":17.573719333333333},{"$f":"'Hinterlegte Gleichungen'!O43","v":250.77545474870226},{"$f":"'Hinterlegte Gleichungen'!O44","v":377.32200120253009},{"$f":"'Hinterlegte Gleichungen'!O46","v":438.00565220253009},{"$f":"'Hinterlegte Gleichungen'!O47","v":496.90452253586341},{"$f":"'Hinterlegte Gleichungen'!O48","v":576.27187554094348},{"$f":"'Hinterlegte Gleichungen'!O49","v":630.54657793056344},"W",null,{"$f":"'Hinterlegte Gleichungen'!BE42","v":21.859992341463414},{"$f":"'Hinterlegte Gleichungen'!BE43","v":309.80005208169479},{"$f":"'Hinterlegte Gleichungen'!BE44","v":465.73734812455183},{"$f":"'Hinterlegte Gleichungen'!BE46","v":540.36105329121847},{"$f":"'Hinterlegte Gleichungen'!BE47","v":613.06434635892674},{"$f":"'Hinterlegte Gleichungen'!BE48","v":713.11135576755373},{"$f":"'Hinterlegte Gleichungen'!BE49","v":780.28934624593717},"W"]
[null,{"$f":"IF(Sprache=\"Deutsch\",VLOOKUP(\"Schallleistungspegel - MQ Gerät\",Legende!$B$3:$E$83,1,FALSE),IF(Sprache=\"English\",VLOOKUP(\"Schallleistungspegel - MQ Gerät\",Legende!$B$3:$E$83,2,FALSE),IF(Sprache=\"Francais\",VLOOKUP(\"Schallleistungspegel - MQ Gerät\",Legende!$B$3:$E$83,3,FALSE),0)))","v":"Schallleistungspegel - MQ Gerät"},null,null,{"$f":"IF('Hinterlegte Gleichungen'!AC65>28,('Hinterlegte Gleichungen'!AC65),IF('Hinterlegte Gleichungen'!AC65<28,\"< 28\"))","v":"< 28"},{"$f":"IF('Hinterlegte Gleichungen'!AD65>28,('Hinterlegte Gleichungen'!AD65),IF('Hinterlegte Gleichungen'!AD65<28,\"< 28\"))","v":"< 28"},{"$f":"IF('Hinterlegte Gleichungen'!AE65>28,('Hinterlegte Gleichungen'!AE65),IF('Hinterlegte Gleichungen'!AE65<28,\"< 28\"))","v":"< 28"},{"$f":"IF('Hinterlegte Gleichungen'!AF65>28,('Hinterlegte Gleichungen'!AF65),IF('Hinterlegte Gleichungen'!AF65<28,\"< 28\"))","v":28.906296527044947},{"$f":"IF('Hinterlegte Gleichungen'!AG65>28,('Hinterlegte Gleichungen'!AG65),IF('Hinterlegte Gleichungen'!AG65<28,\"< 28\"))","v":31.358638928121596},{"$f":"IF('Hinterlegte Gleichungen'!AH65>28,('Hinterlegte Gleichungen'!AH65),IF('Hinterlegte Gleichungen'!AH65<28,\"< 28\"))","v":31.327776424157538},{"$f":"IF('Hinterlegte Gleichungen'!AI65>28,('Hinterlegte Gleichungen'!AI65),IF('Hinterlegte Gleichungen'!AI65<28,\"< 28\"))","v":31.094130954532357},"dB(A)",null,{"$f":"IF('Hinterlegte Gleichungen'!H65>28,('Hinterlegte Gleichungen'!H65),IF('Hinterlegte Gleichungen'!H65<28,\"< 28\"))","v":29.125283427196237},{"$f":"IF('Hinterlegte Gleichungen'!I65>28,('Hinterlegte Gleichungen'!I65),IF('Hinterlegte Gleichungen'!I65<28,\"< 28\"))","v":28.341039915907007},{"$f":"IF('Hinterlegte Gleichungen'!J65>28,('Hinterlegte Gleichungen'!J65),IF('Hinterlegte Gleichungen'!J65<28,\"< 28\"))","v":28.343902905835371},{"$f":"IF('Hinterlegte Gleichungen'!K65>28,('Hinterlegte Gleichungen'!K65),IF('Hinterlegte Gleichungen'!K65<28,\"< 28\"))","v":30.947496353604194},{"$f":"IF('Hinterlegte Gleichungen'!L65>28,('Hinterlegte Gleichungen'!L65),IF('Hinterlegte Gleichungen'!L65<28,\"< 28\"))","v":33.399838754680843},{"$f":"IF('Hinterlegte Gleichungen'!M65>28,('Hinterlegte Gleichungen'!M65),IF('Hinterlegte Gleichungen'!M65<28,\"< 28\"))","v":33.476214904634517},{"$f":"IF('Hinterlegte Gleichungen'!N65>28,('Hinterlegte Gleichungen'!N65),IF('Hinterlegte Gleichungen'!N65<28,\"< 28\"))","v":33.242569435009337},"dB(A)",null,{"$f":"IF('Hinterlegte Gleichungen'!AX65>28,('Hinterlegte Gleichungen'!AX65),IF('Hinterlegte Gleichungen'!AX65<28,\"< 28\"))","v":30.073146620978246},{"$f":"IF('Hinterlegte Gleichungen'!AY65>28,('Hinterlegte Gleichungen'!AY65),IF('Hinterlegte Gleichungen'!AY65<28,\"< 28\"))","v":29.268580448275994},{"$f":"IF('Hinterlegte Gleichungen'!AZ65>28,('Hinterlegte Gleichungen'!AZ65),IF('Hinterlegte Gleichungen'!AZ65<28,\"< 28\"))","v":29.271443438204358},{"$f":"IF('Hinterlegte Gleichungen'!BA65>28,('Hinterlegte Gleichungen'!BA65),IF('Hinterlegte Gleichungen'!BA65<28,\"< 28\"))","v":31.861967526669737},{"$f":"IF('Hinterlegte Gleichungen'!BB65>28,('Hinterlegte Gleichungen'!BB65),IF('Hinterlegte Gleichungen'!BB65<28,\"< 28\"))","v":34.314309927746386},{"$f":"IF('Hinterlegte Gleichungen'!BC65>28,('Hinterlegte Gleichungen'!BC65),IF('Hinterlegte Gleichungen'!BC65<28,\"< 28\"))","v":34.424078098416523},{"$f":"IF('Hinterlegte Gleichungen'!BD65>28,('Hinterlegte Gleichungen'!BD65),IF('Hinterlegte Gleichungen'!BD65<28,\"< 28\"))","v":34.190432628791342},"dB(A)"]
[null,{"$f":"IF(Sprache=\"Deutsch\",VLOOKUP(\"Schallleistungspegel - MQQ Gerät\",Legende!$B$3:$E$83,1,FALSE),IF(Sprache=\"English\",VLOOKUP(\"Schallleistungspegel - MQQ Gerät\",Legende!$B$3:$E$83,2,FALSE),IF(Sprache=\"Francais\",VLOOKUP(\"Schallleistungspegel - MQQ Gerät\",Legende!$B$3:$E$83,3,FALSE),0)))","v":"Schallleistungspegel - MQQ Gerät"},null,null,{"$f":"IF('Hinterlegte Gleichungen'!AC66>28,('Hinterlegte Gleichungen'!AC66),IF('Hinterlegte Gleichungen'!AC66<28,\"< 28\"))","v":"< 28"},{"$f":"IF('Hinterlegte Gleichungen'!AD66>28,('Hinterlegte Gleichungen'!AD66),IF('Hinterlegte Gleichungen'!AD66<28,\"< 28\"))","v":"< 28"},{"$f":"IF('Hinterlegte Gleichungen'!AE66>28,('Hinterlegte Gleichungen'!AE66),IF('Hinterlegte Gleichungen'!AE66<28,\"< 28\"))","v":"< 28"},{"$f":"IF('Hinterlegte Gleichungen'!AF66>28,('Hinterlegte Gleichungen'!AF66),IF('Hinterlegte Gleichungen'!AF66<28,\"< 28\"))","v":29.339600966743536},{"$f":"IF('Hinterlegte Gleichungen'!AG66>28,('Hinterlegte Gleichungen'!AG66),IF('Hinterlegte Gleichungen'!AG66<28,\"< 28\"))","v":33.531946111590692},{"$f":"IF('Hinterlegte Gleichungen'!AH66>28,('Hinterlegte Gleichungen'!AH66),IF('Hinterlegte Gleichungen'!AH66<28,\"< 28\"))","v":32.471558018191814},{"$f":"IF('Hinterlegte Gleichungen'!AI66>28,('Hinterlegte Gleichungen'!AI66),IF('Hinterlegte Gleichungen'!AI66<28,\"< 28\"))","v":32.107990993707062},"dB(A)",null,{"$f":"IF('Hinterlegte Gleichungen'!H66>28,('Hinterlegte Gleichungen'!H66),IF('Hinterlegte Gleichungen'!H66<28,\"< 28\"))","v":29.125283427196237},{"$f":"IF('Hinterlegte Gleichungen'!I66>28,('Hinterlegte Gleichungen'!I66),IF('Hinterlegte Gleichungen'!I66<28,\"< 28\"))","v":28.341039915907007},{"$f":"IF('Hinterlegte Gleichungen'!J66>28,('Hinterlegte Gleichungen'!J66),IF('Hinterlegte Gleichungen'!J66<28,\"< 28\"))","v":28.343902905835371},{"$f":"IF('Hinterlegte Gleichungen'!K66>28,('Hinterlegte Gleichungen'!K66),IF('Hinterlegte Gleichungen'!K66<28,\"< 28\"))","v":31.380800793302782},{"$f":"IF('Hinterlegte Gleichungen'!L66>28,('Hinterlegte Gleichungen'!L66),IF('Hinterlegte Gleichungen'!L66<28,\"< 28\"))","v":35.573145938149942},{"$f":"IF('Hinterlegte Gleichungen'!M66>28,('Hinterlegte Gleichungen'!M66),IF('Hinterlegte Gleichungen'!M66<28,\"< 28\"))","v":34.61999649866879},{"$f":"IF('Hinterlegte Gleichungen'!N66>28,('Hinterlegte Gleichungen'!N66),IF('Hinterlegte Gleichungen'!N66<28,\"< 28\"))","v":34.256429474184038},"dB(A)",null,{"$f":"IF('Hinterlegte Gleichungen'!AX66>28,('Hinterlegte Gleichungen'!AX66),IF('Hinterlegte Gleichungen'!AX66<28,\"< 28\"))","v":30.073146620978246},{"$f":"IF('Hinterlegte Gleichungen'!AY66>28,('Hinterlegte Gleichungen'!AY66),IF('Hinterlegte Gleichungen'!AY66<28,\"< 28\"))","v":29.268580448275994},{"$f":"IF('Hinterlegte Gleichungen'!AZ66>28,('Hinterlegte Gleichungen'!AZ66),IF('Hinterlegte Gleichungen'!AZ66<28,\"< 28\"))","v":29.271443438204358},{"$f":"IF('Hinterlegte Gleichungen'!BA66>28,('Hinterlegte Gleichungen'!BA66),IF('Hinterlegte Gleichungen'!BA66<28,\"< 28\"))","v":32.295271966368325},{"$f":"IF('Hinterlegte Gleichungen'!BB66>28,('Hinterlegte Gleichungen'!BB66),IF('Hinterlegte Gleichungen'!BB66<28,\"< 28\"))","v":36.487617111215485},{"$f":"IF('Hinterlegte Gleichungen'!BC66>28,('Hinterlegte Gleichungen'!BC66),IF('Hinterlegte Gleichungen'!BC66<28,\"< 28\"))","v":35.567859692450796},{"$f":"IF('Hinterlegte Gleichungen'!BD66>28,('Hinterlegte Gleichungen'!BD66),IF('Hinterlegte Gleichungen'!BD66<28,\"< 28\"))","v":35.204292667966044},"dB(A)"]
[null,null,null,null,null,null,null,null,null,null,{"$f":"IF(Sprache=\"Deutsch\",VLOOKUP(\"Toleranz +/- 3 dB\",Legende!$B$3:$E$83,1,FALSE),IF(Sprache=\"English\",VLOOKUP(\"Toleranz +/- 3 dB\",Legende!$B$3:$E$83,2,FALSE),IF(Sprache=\"Francais\",VLOOKUP(\"Toleranz +/- 3 dB\",Legende!$B$3:$E$83,3,FALSE),0)))","v":"Toleranz +/- 3 dB"},null,null,null,null,null,null,null,null,{"$f":"IF(Sprache=\"Deutsch\",VLOOKUP(\"Toleranz +/- 3 dB\",Legende!$B$3:$E$83,1,FALSE),IF(Sprache=\"English\",VLOOKUP(\"Toleranz +/- 3 dB\",Legende!$B$3:$E$83,2,FALSE),IF(Sprache=\"Francais\",VLOOKUP(\"Toleranz +/- 3 dB\",Legende!$B$3:$E$83,3,FALSE),0)))","v":"Toleranz +/- 3 dB"},null,null,null,null,null,null,null,null,{"$f":"IF(Sprache=\"Deutsch\",VLOOKUP(\"Toleranz +/- 3 dB\",Legende!$B$3:$E$83,1,FALSE),IF(Sprache=\"English\",VLOOKUP(\"Toleranz +/- 3 dB\",Legende!$B$3:$E$83,2,FALSE),IF(Sprache=\"Francais\",VLOOKUP(\"Toleranz +/- 3 dB\",Legende!$B$3:$E$83,3,FALSE),0)))","v":"Toleranz +/- 3 dB"}]
[]
[null,{"$f":"IF(Sprache=\"Deutsch\",VLOOKUP(\"Regelbereich\",Legende!$B$3:$E$83,1,FALSE),IF(Sprache=\"English\",VLOOKUP(\"Regelbereich\",Legende!$B$3:$E$83,2,FALSE),IF(Sprache=\"Francais\",VLOOKUP(\"Regelbereich\",Legende!$B$3:$E$83,3,FALSE),0)))","v":"Regelbereich"}]
[]
[null,null,{"$f":"IF(Sprache=\"Deutsch\",VLOOKUP(\"Leistung [W]\",Legende!$B$3:$E$83,1,FALSE),IF(Sprache=\"English\",VLOOKUP(\"Leistung [W]\",Legende!$B$3:$E$83,2,FALSE),IF(Sprache=\"Francais\",VLOOKUP(\"Leistung [W]\",Legende!$B$3:$E$83,3,FALSE),0)))","v":"Leistung [W]"},null,null,null,null,null,null,null,null,null,null,null,null,null,null,null,null,null,null,null,null,null,null,null,null,null,null,{"$f":"IF(Sprache=\"Deutsch\",VLOOKUP(\"Schallleistungspegel [dB(A)]\",Legende!$B$3:$E$83,1,FALSE),IF(Sprache=\"English\",VLOOKUP(\"Schallleistungspegel [dB(A)]\",Legende!$B$3:$E$83,2,FALSE),IF(Sprache=\"Francais\",VLOOKUP(\"Schallleistungspegel [dB(A)]\",Legende!$B$3:$E$83,3,FALSE),0)))","v":"Schallleistungspegel [dB(A)]"}]
[]
[]
[]
[]
[]
[]
[]
[]
[]
[null,null,null,null,null,{"$f":"IF(Sprache=\"Deutsch\",VLOOKUP(\"Primärvolumenstrom - Vp [m³/h]\",Legende!$B$3:$E$83,1,FALSE),IF(Sprache=\"English\",VLOOKUP(\"Primärvolumenstrom - Vp [m³/h]\",Legende!$B$3:$E$83,2,FALSE),IF(Sprache=\"Francais\",VLOOKUP(\"Primärvolumenstrom - Vp [m³/h]\",Legende!$B$3:$E$83,3,FALSE),0)))","v":"Primärvolumenstrom - Vp [m³/h]"},null,null,null,null,null,null,null,null,{"$f":"IF(Sprache=\"Deutsch\",VLOOKUP(\"Primärvolumenstrom - Vp [m³/h]\",Legende!$B$3:$E$83,1,FALSE),IF(Sprache=\"English\",VLOOKUP(\"Primärvolumenstrom - Vp [m³/h]\",Legende!$B$3:$E$83,2,FALSE),IF(Sprache=\"Francais\",VLOOKUP(\"Primärvolumenstrom - Vp [m³/h]\",Legende!$B$3:$E$83,3,FALSE),0)))","v":"Primärvolumenstrom - Vp [m³/h]"},null,null,null,null,null,null,null,null,{"$f":"IF(Sprache=\"Deutsch\",VLOOKUP(\"Primärvolumenstrom - Vp [m³/h]\",Legende!$B$3:$E$83,1,FALSE),IF(Sprache=\"English\",VLOOKUP(\"Primärvolumenstrom - Vp [m³/h]\",Legende!$B$3:$E$83,2,FALSE),IF(Sprache=\"Francais\",VLOOKUP(\"Primärvolumenstrom - Vp [m³/h]\",Legende!$B$3:$E$83,3,FALSE),0)))","v":"Primärvolumenstrom - Vp [m³/h]"}]
[]
[null,null,null,null,null,null,{"$f":"IF(Sprache=\"Deutsch\",VLOOKUP(\"Primärleistung\",Legende!$B$3:$E$83,1,FALSE),IF(Sprache=\"English\",VLOOKUP(\"Primärleistung\",Legende!$B$3:$E$83,2,FALSE),IF(Sprache=\"Francais\",VLOOKUP(\"Primärleistung\",Legende!$B$3:$E$83,3,FALSE),0)))","v":"Primärleistung"},null,null,null,null,null,null,null,null,{"$f":"IF(Sprache=\"Deutsch\",VLOOKUP(\"Primärleistung\",Legende!$B$3:$E$83,1,FALSE),IF(Sprache=\"English\",VLOOKUP(\"Primärleistung\",Legende!$B$3:$E$83,2,FALSE),IF(Sprache=\"Francais\",VLOOKUP(\"Primärleistung\",Legende!$B$3:$E$83,3,FALSE),0)))","v":"Primärleistung"},null,null,null,null,null,null,null,null,{"$f":"IF(Sprache=\"Deutsch\",VLOOKUP(\"Primärleistung\",Legende!$B$3:$E$83,1,FALSE),IF(Sprache=\"English\",VLOOKUP(\"Primärleistung\",Legende!$B$3:$E$83,2,FALSE),IF(Sprache=\"Francais\",VLOOKUP(\"Primärleistung\",Legende!$B$3:$E$83,3,FALSE),0)))","v":"Primärleistung"}]
[null,null,null,null,null,null,{"$f":"IF(Sprache=\"Deutsch\",VLOOKUP(\"Sekundärleistung\",Legende!$B$3:$E$83,1,FALSE),IF(Sprache=\"English\",VLOOKUP(\"Sekundärleistung\",Legende!$B$3:$E$83,2,FALSE),IF(Sprache=\"Francais\",VLOOKUP(\"Sekundärleistung\",Legende!$B$3:$E$83,3,FALSE),0)))","v":"Sekundärleistung"},null,null,null,null,null,null,null,null,{"$f":"IF(Sprache=\"Deutsch\",VLOOKUP(\"Sekundärleistung\",Legende!$B$3:$E$83,1,FALSE),IF(Sprache=\"English\",VLOOKUP(\"Sekundärleistung\",Legende!$B$3:$E$83,2,FALSE),IF(Sprache=\"Francais\",VLOOKUP(\"Sekundärleistung\",Legende!$B$3:$E$83,3,FALSE),0)))","v":"Sekundärleistung"},null,null,null,null,null,null,null,null,{"$f":"IF(Sprache=\"Deutsch\",VLOOKUP(\"Sekundärleistung\",Legende!$B$3:$E$83,1,FALSE),IF(Sprache=\"English\",VLOOKUP(\"Sekundärleistung\",Legende!$B$3:$E$83,2,FALSE),IF(Sprache=\"Francais\",VLOOKUP(\"Sekundärleistung\",Legende!$B$3:$E$83,3,FALSE),0)))","v":"Sekundärleistung"}]
[null,null,null,null,null,null,{"$f":"IF(Sprache=\"Deutsch\",VLOOKUP(\"Gesamt Kühlleistung\",Legende!$B$3:$E$83,1,FALSE),IF(Sprache=\"English\",VLOOKUP(\"Gesamt Kühlleistung\",Legende!$B$3:$E$83,2,FALSE),IF(Sprache=\"Francais\",VLOOKUP(\"Gesamt Kühlleistung\",Legende!$B$3:$E$83,3,FALSE),0)))","v":"Gesamt Kühlleistung"},null,null,null,null,null,null,null,null,{"$f":"IF(Sprache=\"Deutsch\",VLOOKUP(\"Gesamt Kühlleistung\",Legende!$B$3:$E$83,1,FALSE),IF(Sprache=\"English\",VLOOKUP(\"Gesamt Kühlleistung\",Legende!$B$3:$E$83,2,FALSE),IF(Sprache=\"Francais\",VLOOKUP(\"Gesamt Kühlleistung\",Legende!$B$3:$E$83,3,FALSE),0)))","v":"Gesamt Kühlleistung"},null,null,null,null,null,null,null,null,{"$f":"IF(Sprache=\"Deutsch\",VLOOKUP(\"Gesamt Kühlleistung\",Legende!$B$3:$E$83,1,FALSE),IF(Sprache=\"English\",VLOOKUP(\"Gesamt Kühlleistung\",Legende!$B$3:$E$83,2,FALSE),IF(Sprache=\"Francais\",VLOOKUP(\"Gesamt Kühlleistung\",Legende!$B$3:$E$83,3,FALSE),0)))","v":"Gesamt Kühlleistung"}]
[]
[]
[null,{"$f":"IF(Sprache=\"Deutsch\",VLOOKUP(\"© LTG Aktiengesellschaft - Letzte Änderung: 13.03.2012\",Legende!$B$3:$E$83,1,FALSE),IF(Sprache=\"English\",VLOOKUP(\"© LTG Aktiengesellschaft - Letzte Änderung: 13.03.2012\",Legende!$B$3:$E$83,2,FALSE),IF(Sprache=\"Francais\",VLOOKUP(\"© LTG Aktiengesellschaft - Letzte Änderung: 13.03.2012\",Legende!$B$3:$E$83,3,FALSE),0)))","v":"© LTG Aktiengesellschaft - Letzte Änderung: 13.03.2012"}]
[null,{"$f":"IF(Sprache=\"Deutsch\",VLOOKUP(\"Angaben zu Toleranzen sowie weitere Spezifikationen sind der aktuellen LTG Bauteilmappe zu entnehmen.\",Legende!$B$3:$E$83,1,FALSE),IF(Sprache=\"English\",VLOOKUP(\"Angaben zu Toleranzen sowie weitere Spezifikationen sind der aktuellen LTG Bauteilmappe zu entnehmen.\",Legende!$B$3:$E$83,2,FALSE),IF(Sprache=\"Francais\",VLOOKUP(\"Angaben zu Toleranzen sowie weitere Spezifikationen sind der aktuellen LTG Bauteilmappe zu entnehmen.\",Legende!$B$3:$E$83,3,FALSE),0)))","v":"Angaben zu Toleranzen sowie weitere Spezifikationen sind der aktuellen LTG Bauteilmappe zu entnehmen."}]
[null,{"$f":"IF(Sprache=\"Deutsch\",VLOOKUP(\"Eine Fehlerfreiheit des Programms kann nicht zugesichert werden. Im Zweifel gelten die technischen Daten der aktuellen LTG Bauteilmappe.\",Legende!$B$3:$E$83,1,FALSE),IF(Sprache=\"English\",VLOOKUP(\"Eine Fehlerfreiheit des Programms kann nicht zugesichert werden. Im Zweifel gelten die technischen Daten der aktuellen LTG Bauteilmappe.\",Legende!$B$3:$E$83,2,FALSE),IF(Sprache=\"Francais\",VLOOKUP(\"Eine Fehlerfreiheit des Programms kann nicht zugesichert werden. Im Zweifel gelten die technischen Daten der aktuellen LTG Bauteilmappe.\",Legende!$B$3:$E$83,3,FALSE),0)))","v":"Eine Fehlerfreiheit des Programms kann nicht zugesichert werden. Im Zweifel gelten die technischen Daten der aktuellen LTG Bauteilmappe."}]
[null,{"$f":"IF(Sprache=\"Deutsch\",VLOOKUP(\"Aus Programmierfehlern entstandener Schaden geht nicht zu Lasten der LTG. Technische Änderungen im Rahmen der Weiterentwicklung vorbehalten.\",Legende!$B$3:$E$83,1,FALSE),IF(Sprache=\"English\",VLOOKUP(\"Aus Programmierfehlern entstandener Schaden geht nicht zu Lasten der LTG. Technische Änderungen im Rahmen der Weiterentwicklung vorbehalten.\",Legende!$B$3:$E$83,2,FALSE),IF(Sprache=\"Francais\",VLOOKUP(\"Aus Programmierfehlern entstandener Schaden geht nicht zu Lasten der LTG. Technische Änderungen im Rahmen der Weiterentwicklung vorbehalten.\",Legende!$B$3:$E$83,3,FALSE),0)))","v":"Aus Programmierfehlern entstandener Schaden geht nicht zu Lasten der LTG. Technische Änderungen im Rahmen der Weiterentwicklung vorbehalten."}]

{"sheet":"HFVsf-_-4 - Heizen","index":1,"n_rows":58,"n_cols":30,"rows_kept":58,"cut":false,"hidden":false,"merged":[[37,2,44,3],[37,29,44,30],[20,22,20,28],[28,4,28,5],[28,13,28,14],[28,22,28,23],[20,4,20,10],[20,13,20,19],[4,25,4,26],[5,25,5,27],[6,25,6,27],[7,25,7,27],[9,4,9,5],[13,4,13,5],[14,4,14,5],[17,4,17,5],[18,4,18,5],[10,4,10,5]]}
[null,"Tel.  +49 (0)711 8201-180   Fax: -720",null,null,null,null,null,null,null,null,null,null,null,null,null,null,null,null,null,null,null,null,null,null,null,"eMail:",null,null,null,"Raumluft@LTG-AG.de"]
[null,{"$f":"IF(Sprache=\"Deutsch\",VLOOKUP(\"Induktionsgerät HFVsf - System smart flow, 4-Leiter-System\",Legende!$B$3:$E$83,1,FALSE),IF(Sprache=\"English\",VLOOKUP(\"Induktionsgerät HFVsf - System smart flow, 4-Leiter-System\",Legende!$B$3:$E$83,2,FALSE),IF(Sprache=\"Francais\",VLOOKUP(\"Induktionsgerät HFVsf - System smart flow, 4-Leiter-System\",Legende!$B$3:$E$83,3,FALSE),0)))","v":"Induktionsgerät HFVsf - System smart flow, 4-Leiter-System"},null,null,null,null,null,null,null,null,null,null,null,null,null,null,null,null,null,null,null,{"$f":"IF(Sprache=\"Deutsch\",VLOOKUP(\"Sprache:\",Legende!$B$3:$E$83,1,FALSE),IF(Sprache=\"English\",VLOOKUP(\"Sprache:\",Legende!$B$3:$E$83,2,FALSE),IF(Sprache=\"Francais\",VLOOKUP(\"Sprache:\",Legende!$B$3:$E$83,3,FALSE),0)))","v":"Sprache:"},{"$f":"Sprache","v":"Deutsch"},null,null,null,null,null,null,"LTG Aktiengesellschaft"]
[]
[]
[null,null,null,null,null,null,null,null,null,null,null,null,null,null,null,null,null,null,null,null,null,null,null,null,{"$f":"IF(Sprache=\"Deutsch\",VLOOKUP(\"Datum:\",Legende!$B$3:$E$83,1,FALSE),IF(Sprache=\"English\",VLOOKUP(\"Datum:\",Legende!$B$3:$E$83,2,FALSE),IF(Sprache=\"Francais\",VLOOKUP(\"Datum:\",Legende!$B$3:$E$83,3,FALSE),0)))","v":"Datum:"},{"$f":"TODAY()","v":"2026-06-23"}]
[null,null,null,null,null,null,null,null,null,null,null,null,null,null,null,null,null,null,null,null,null,null,null,null,{"$f":"IF(Sprache=\"Deutsch\",VLOOKUP(\"Bearbeiter:\",Legende!$B$3:$E$83,1,FALSE),IF(Sprache=\"English\",VLOOKUP(\"Bearbeiter:\",Legende!$B$3:$E$83,2,FALSE),IF(Sprache=\"Francais\",VLOOKUP(\"Bearbeiter:\",Legende!$B$3:$E$83,3,FALSE),0)))","v":"Bearbeiter:"}]
[null,null,null,null,null,null,null,null,null,null,null,null,null,null,null,null,null,null,null,null,null,null,null,null,{"$f":"IF(Sprache=\"Deutsch\",VLOOKUP(\"Projekt:\",Legende!$B$3:$E$83,1,FALSE),IF(Sprache=\"English\",VLOOKUP(\"Projekt:\",Legende!$B$3:$E$83,2,FALSE),IF(Sprache=\"Francais\",VLOOKUP(\"Projekt:\",Legende!$B$3:$E$83,3,FALSE),0)))","v":"Projekt:"}]
[null,null,null,null,null,null,null,null,null,null,null,null,null,null,null,null,null,null,null,null,null,null,null,null,{"$f":"IF(Sprache=\"Deutsch\",VLOOKUP(\"Variante:\",Legende!$B$3:$E$83,1,FALSE),IF(Sprache=\"English\",VLOOKUP(\"Variante:\",Legende!$B$3:$E$83,2,FALSE),IF(Sprache=\"Francais\",VLOOKUP(\"Variante:\",Legende!$B$3:$E$83,3,FALSE),0)))","v":"Variante:"}]
[]
[null,{"$f":"IF(Sprache=\"Deutsch\",VLOOKUP(\"Auslegunsbedingungen:\",Legende!$B$3:$E$83,1,FALSE),IF(Sprache=\"English\",VLOOKUP(\"Auslegunsbedingungen:\",Legende!$B$3:$E$83,2,FALSE),IF(Sprache=\"Francais\",VLOOKUP(\"Auslegunsbedingungen:\",Legende!$B$3:$E$83,3,FALSE),0)))","v":"Auslegunsbedingungen:"},null,null,{"$f":"IF(Sprache=\"Deutsch\",VLOOKUP(\"Heizen\",Legende!$B$3:$E$83,1,FALSE),IF(Sprache=\"English\",VLOOKUP(\"Heizen\",Legende!$B$3:$E$83,2,FALSE),IF(Sprache=\"Francais\",VLOOKUP(\"Heizen\",Legende!$B$3:$E$83,3,FALSE),0)))","v":"Heizen"},null,null,null,{"$f":"IF(Sprache=\"Deutsch\",VLOOKUP(\"Bemerkungen:\",Legende!$B$3:$E$83,1,FALSE),IF(Sprache=\"English\",VLOOKUP(\"Bemerkungen:\",Legende!$B$3:$E$83,2,FALSE),IF(Sprache=\"Francais\",VLOOKUP(\"Bemerkungen:\",Legende!$B$3:$E$83,3,FALSE),0)))","v":"Bemerkungen:"}]
[null,{"$f":"IF(Sprache=\"Deutsch\",VLOOKUP(\"Raumlufttemperatur\",Legende!$B$3:$E$83,1,FALSE),IF(Sprache=\"English\",VLOOKUP(\"Raumlufttemperatur\",Legende!$B$3:$E$83,2,FALSE),IF(Sprache=\"Francais\",VLOOKUP(\"Raumlufttemperatur\",Legende!$B$3:$E$83,3,FALSE),0)))","v":"Raumlufttemperatur"},null,null,22,null,null,null,{"$f":"IF(Sprache=\"Deutsch\",VLOOKUP(\" => Ablufttemperatur\",Legende!$B$3:$E$83,1,FALSE),IF(Sprache=\"English\",VLOOKUP(\" => Ablufttemperatur\",Legende!$B$3:$E$83,2,FALSE),IF(Sprache=\"Francais\",VLOOKUP(\" => Ablufttemperatur\",Legende!$B$3:$E$83,3,FALSE),0)))","v":" => Ablufttemperatur"}]
[]
[null,{"$f":"IF(Sprache=\"Deutsch\",VLOOKUP(\"Primärseite (Luftseite):\",Legende!$B$3:$E$83,1,FALSE),IF(Sprache=\"English\",VLOOKUP(\"Primärseite (Luftseite):\",Legende!$B$3:$E$83,2,FALSE),IF(Sprache=\"Francais\",VLOOKUP(\"Primärseite (Luftseite):\",Legende!$B$3:$E$83,3,FALSE),0)))","v":"Primärseite (Luftseite):"}]
[null,{"$f":"IF(Sprache=\"Deutsch\",VLOOKUP(\"Primärdruck\",Legende!$B$3:$E$83,1,FALSE),IF(Sprache=\"English\",VLOOKUP(\"Primärdruck\",Legende!$B$3:$E$83,2,FALSE),IF(Sprache=\"Francais\",VLOOKUP(\"Primärdruck\",Legende!$B$3:$E$83,3,FALSE),0)))","v":"Primärdruck"},null,null,100,null,null,null,{"$f":"IF(Sprache=\"Deutsch\",VLOOKUP(\"Bereich:\",Legende!$B$3:$E$83,1,FALSE),IF(Sprache=\"English\",VLOOKUP(\"Bereich:\",Legende!$B$3:$E$83,2,FALSE),IF(Sprache=\"Francais\",VLOOKUP(\"Bereich:\",Legende!$B$3:$E$83,3,FALSE),0)))","v":"Bereich:"},null,"50 - 150 Pa"]
[null,{"$f":"IF(Sprache=\"Deutsch\",VLOOKUP(\"Primärlufttemperatur\",Legende!$B$3:$E$83,1,FALSE),IF(Sprache=\"English\",VLOOKUP(\"Primärlufttemperatur\",Legende!$B$3:$E$83,2,FALSE),IF(Sprache=\"Francais\",VLOOKUP(\"Primärlufttemperatur\",Legende!$B$3:$E$83,3,FALSE),0)))","v":"Primärlufttemperatur"},null,null,18,null,null,null,{"$f":"IF(Sprache=\"Deutsch\",VLOOKUP(\"Bereich:\",Legende!$B$3:$E$83,1,FALSE),IF(Sprache=\"English\",VLOOKUP(\"Bereich:\",Legende!$B$3:$E$83,2,FALSE),IF(Sprache=\"Francais\",VLOOKUP(\"Bereich:\",Legende!$B$3:$E$83,3,FALSE),0)))","v":"Bereich:"},null,"18 - 30 °C"]
[]
[null,{"$f":"IF(Sprache=\"Deutsch\",VLOOKUP(\"Sekundärseite (Wasserseite):\",Legende!$B$3:$E$83,1,FALSE),IF(Sprache=\"English\",VLOOKUP(\"Sekundärseite (Wasserseite):\",Legende!$B$3:$E$83,2,FALSE),IF(Sprache=\"Francais\",VLOOKUP(\"Sekundärseite (Wasserseite):\",Legende!$B$3:$E$83,3,FALSE),0)))","v":"Sekundärseite (Wasserseite):"}]
[null,{"$f":"IF(Sprache=\"Deutsch\",VLOOKUP(\"Wasservorlauftemperatur\",Legende!$B$3:$E$83,1,FALSE),IF(Sprache=\"English\",VLOOKUP(\"Wasservorlauftemperatur\",Legende!$B$3:$E$83,2,FALSE),IF(Sprache=\"Francais\",VLOOKUP(\"Wasservorlauftemperatur\",Legende!$B$3:$E$83,3,FALSE),0)))","v":"Wasservorlauftemperatur"},null,null,55,null,null,null,{"$f":"IF(Sprache=\"Deutsch\",VLOOKUP(\"Bereich:\",Legende!$B$3:$E$83,1,FALSE),IF(Sprache=\"English\",VLOOKUP(\"Bereich:\",Legende!$B$3:$E$83,2,FALSE),IF(Sprache=\"Francais\",VLOOKUP(\"Bereich:\",Legende!$B$3:$E$83,3,FALSE),0)))","v":"Bereich:"},null,"30 - 60 °C"]
[null,{"$f":"IF(Sprache=\"Deutsch\",VLOOKUP(\"Wassermassenstrom\",Legende!$B$3:$E$83,1,FALSE),IF(Sprache=\"English\",VLOOKUP(\"Wassermassenstrom\",Legende!$B$3:$E$83,2,FALSE),IF(Sprache=\"Francais\",VLOOKUP(\"Wassermassenstrom\",Legende!$B$3:$E$83,3,FALSE),0)))","v":"Wassermassenstrom"},null,null,100,null,null,null,{"$f":"IF(Sprache=\"Deutsch\",VLOOKUP(\"Bereich:\",Legende!$B$3:$E$83,1,FALSE),IF(Sprache=\"English\",VLOOKUP(\"Bereich:\",Legende!$B$3:$E$83,2,FALSE),IF(Sprache=\"Francais\",VLOOKUP(\"Bereich:\",Legende!$B$3:$E$83,3,FALSE),0)))","v":"Bereich:"},null,"10 - 160 kg/h"]
[]
[null,{"$f":"IF(Sprache=\"Deutsch\",VLOOKUP(\"Geräte Baugröße\",Legende!$B$3:$E$83,1,FALSE),IF(Sprache=\"English\",VLOOKUP(\"Geräte Baugröße\",Legende!$B$3:$E$83,2,FALSE),IF(Sprache=\"Francais\",VLOOKUP(\"Geräte Baugröße\",Legende!$B$3:$E$83,3,FALSE),0)))","v":"Geräte Baugröße"},null,null,630,null,null,null,null,null,null,null,null,800,null,null,null,null,null,null,null,null,1000]
[null,{"$f":"IF(Sprache=\"Deutsch\",VLOOKUP(\"Einstellung Düsenklappe\",Legende!$B$3:$E$83,1,FALSE),IF(Sprache=\"English\",VLOOKUP(\"Einstellung Düsenklappe\",Legende!$B$3:$E$83,2,FALSE),IF(Sprache=\"Francais\",VLOOKUP(\"Einstellung Düsenklappe\",Legende!$B$3:$E$83,3,FALSE),0)))","v":"Einstellung Düsenklappe"},null,null,"V0","V1","V2","V3","V4","V5","V6",null,null,"V0","V1","V2","V3","V4","V5","V6",null,null,"V0","V1","V2","V3","V4","V5","V6"]
[]
[null,{"$f":"IF(Sprache=\"Deutsch\",VLOOKUP(\"Primärvolumenstrom - Vp\",Legende!$B$3:$E$83,1,FALSE),IF(Sprache=\"English\",VLOOKUP(\"Primärvolumenstrom - Vp\",Legende!$B$3:$E$83,2,FALSE),IF(Sprache=\"Francais\",VLOOKUP(\"Primärvolumenstrom - Vp\",Legende!$B$3:$E$83,3,FALSE),0)))","v":"Primärvolumenstrom - Vp"},null,null,{"$f":"'Hinterlegte Gleichungen'!AB55","v":4.5924353658536585},{"$f":"'Hinterlegte Gleichungen'!AB56","v":12.422460365853659},{"$f":"'Hinterlegte Gleichungen'!AB57","v":20.158875285714281},{"$f":"'Hinterlegte Gleichungen'!AB59","v":36.607259999999997},{"$f":"'Hinterlegte Gleichungen'!AB60","v":52.383743124999995},{"$f":"'Hinterlegte Gleichungen'!AB61","v":58.409057317073163},{"$f":"'Hinterlegte Gleichungen'!AB62","v":64.2925731707317},"m³/h",null,{"$f":"'Hinterlegte Gleichungen'!G55","v":7.5315940000000001},{"$f":"'Hinterlegte Gleichungen'!G56","v":20.372835000000002},{"$f":"'Hinterlegte Gleichungen'!G57","v":32.564336999999995},{"$f":"'Hinterlegte Gleichungen'!G59","v":58.571615999999999},{"$f":"'Hinterlegte Gleichungen'!G60","v":83.813988999999992},{"$f":"'Hinterlegte Gleichungen'!G61","v":95.790853999999996},{"$f":"'Hinterlegte Gleichungen'!G62","v":105.43982},"m³/h",null,{"$f":"'Hinterlegte Gleichungen'!AW55","v":9.3685681463414632},{"$f":"'Hinterlegte Gleichungen'!AW56","v":25.341819146341468},{"$f":"'Hinterlegte Gleichungen'!AW57","v":40.317750571428562},{"$f":"'Hinterlegte Gleichungen'!AW59","v":72.299338500000005},{"$f":"'Hinterlegte Gleichungen'!AW60","v":103.45789267187499},{"$f":"'Hinterlegte Gleichungen'!AW61","v":119.15447692682926},{"$f":"'Hinterlegte Gleichungen'!AW62","v":131.15684926829269},"m³/h"]
[null,{"$f":"IF(Sprache=\"Deutsch\",VLOOKUP(\"Primärleistung - Qp\",Legende!$B$3:$E$83,1,FALSE),IF(Sprache=\"English\",VLOOKUP(\"Primärleistung - Qp\",Legende!$B$3:$E$83,2,FALSE),IF(Sprache=\"Francais\",VLOOKUP(\"Primärleistung - Qp\",Legende!$B$3:$E$83,3,FALSE),0)))","v":"Primärleistung - Qp"},null,null,{"$f":"'Hinterlegte Gleichungen'!AE55","v":-6.123247154471545},{"$f":"'Hinterlegte Gleichungen'!AE56","v":-16.563280487804878},{"$f":"'Hinterlegte Gleichungen'!AE57","v":-26.878500380952374},{"$f":"'Hinterlegte Gleichungen'!AE59","v":-48.809679999999993},{"$f":"'Hinterlegte Gleichungen'!AE60","v":-69.844990833333327},{"$f":"'Hinterlegte Gleichungen'!AE61","v":-77.878743089430884},{"$f":"'Hinterlegte Gleichungen'!AE62","v":-85.723430894308933},"W",null,{"$f":"'Hinterlegte Gleichungen'!J55","v":-10.042125333333333},{"$f":"'Hinterlegte Gleichungen'!J56","v":-27.163780000000003},{"$f":"'Hinterlegte Gleichungen'!J57","v":-43.419115999999995},{"$f":"'Hinterlegte Gleichungen'!J59","v":-78.095488000000003},{"$f":"'Hinterlegte Gleichungen'!J60","v":-111.75198533333332},{"$f":"'Hinterlegte Gleichungen'!J61","v":-127.72113866666666},{"$f":"'Hinterlegte Gleichungen'!J62","v":-140.58642666666665},"W",null,{"$f":"'Hinterlegte Gleichungen'!AZ55","v":-12.491424195121951},{"$f":"'Hinterlegte Gleichungen'!AZ56","v":-33.78909219512196},{"$f":"'Hinterlegte Gleichungen'!AZ57","v":-53.757000761904749},{"$f":"'Hinterlegte Gleichungen'!AZ59","v":-96.399118000000001},{"$f":"'Hinterlegte Gleichungen'!AZ60","v":-137.94385689583331},{"$f":"'Hinterlegte Gleichungen'!AZ61","v":-158.87263590243901},{"$f":"'Hinterlegte Gleichungen'!AZ62","v":-174.87579902439026},"W"]
[]
[null,{"$f":"IF(Sprache=\"Deutsch\",VLOOKUP(\"Sekundärleistung - Qh\",Legende!$B$3:$E$83,1,FALSE),IF(Sprache=\"English\",VLOOKUP(\"Sekundärleistung - Qh\",Legende!$B$3:$E$83,2,FALSE),IF(Sprache=\"Francais\",VLOOKUP(\"Sekundärleistung - Qh\",Legende!$B$3:$E$83,3,FALSE),0)))","v":"Sekundärleistung - Qh"},null,null,{"$f":"'Hinterlegte Gleichungen'!AI55","v":150.15562107137771},{"$f":"'Hinterlegte Gleichungen'!AI56","v":411.62988476990012},{"$f":"'Hinterlegte Gleichungen'!AI57","v":541.39811397330766},{"$f":"'Hinterlegte Gleichungen'!AI59","v":541.39811397330766},{"$f":"'Hinterlegte Gleichungen'!AI60","v":541.39811397330766},{"$f":"'Hinterlegte Gleichungen'!AI61","v":607.2323994544339},{"$f":"'Hinterlegte Gleichungen'!AI62","v":644.24789628093777},"W",null,{"$f":"'Hinterlegte Gleichungen'!N55","v":228.04070043978501},{"$f":"'Hinterlegte Gleichungen'!N56","v":625.14054802020985},{"$f":"'Hinterlegte Gleichungen'!N57","v":822.21900350013209},{"$f":"'Hinterlegte Gleichungen'!N59","v":822.21900350013209},{"$f":"'Hinterlegte Gleichungen'!N60","v":822.21900350013209},{"$f":"'Hinterlegte Gleichungen'!N61","v":922.20125169670371},{"$f":"'Hinterlegte Gleichungen'!N62","v":978.41652864214723},"W",null,{"$f":"'Hinterlegte Gleichungen'!BD55","v":281.2590669368177},{"$f":"'Hinterlegte Gleichungen'!BD56","v":771.03099096541632},{"$f":"'Hinterlegte Gleichungen'!BD57","v":1014.1020848303847},{"$f":"'Hinterlegte Gleichungen'!BD59","v":1014.1020848303847},{"$f":"'Hinterlegte Gleichungen'!BD60","v":1014.1020848303847},{"$f":"'Hinterlegte Gleichungen'!BD61","v":1137.4174131195048},{"$f":"'Hinterlegte Gleichungen'!BD62","v":1206.7517745329633},"W"]
[null,{"$f":"IF(Sprache=\"Deutsch\",VLOOKUP(\"Wasserrücklauftemperatur\",Legende!$B$3:$E$83,1,FALSE),IF(Sprache=\"English\",VLOOKUP(\"Wasserrücklauftemperatur\",Legende!$B$3:$E$83,2,FALSE),IF(Sprache=\"Francais\",VLOOKUP(\"Wasserrücklauftemperatur\",Legende!$B$3:$E$83,3,FALSE),0)))","v":"Wasserrücklauftemperatur"},null,null,{"$f":"'Hinterlegte Gleichungen'!AL55","v":53.709880105353321},{"$f":"'Hinterlegte Gleichungen'!AL56","v":51.463323185747875},{"$f":"'Hinterlegte Gleichungen'!AL57","v":50.348369426482321},{"$f":"'Hinterlegte Gleichungen'!AL59","v":50.348369426482321},{"$f":"'Hinterlegte Gleichungen'!AL60","v":50.348369426482321},{"$f":"'Hinterlegte Gleichungen'!AL61","v":49.782728787503672},{"$f":"'Hinterlegte Gleichungen'!AL62","v":49.464695879209124},"K",null,{"$f":"'Hinterlegte Gleichungen'!Q55","v":53.040700425815686},{"$f":"'Hinterlegte Gleichungen'!Q56","v":49.628864026556677},{"$f":"'Hinterlegte Gleichungen'!Q57","v":47.93558851408001},{"$f":"'Hinterlegte Gleichungen'!Q59","v":47.93558851408001},{"$f":"'Hinterlegte Gleichungen'!Q60","v":47.93558851408001},{"$f":"'Hinterlegte Gleichungen'!Q61","v":47.076552491388703},{"$f":"'Hinterlegte Gleichungen'!Q62","v":46.593557271809715},"K",null,{"$f":"'Hinterlegte Gleichungen'!BG55","v":52.58345431748797},{"$f":"'Hinterlegte Gleichungen'!BG56","v":48.375390053757755},{"$f":"'Hinterlegte Gleichungen'!BG57","v":46.28695106112319},{"$f":"'Hinterlegte Gleichungen'!BG59","v":46.28695106112319},{"$f":"'Hinterlegte Gleichungen'!BG60","v":46.28695106112319},{"$f":"'Hinterlegte Gleichungen'!BG61","v":45.22743988727872},{"$f":"'Hinterlegte Gleichungen'!BG62","v":44.631726996852827},"K"]
[null,{"$f":"IF(Sprache=\"Deutsch\",VLOOKUP(\"Wasserseitiger Druckverlust\",Legende!$B$3:$E$83,1,FALSE),IF(Sprache=\"English\",VLOOKUP(\"Wasserseitiger Druckverlust\",Legende!$B$3:$E$83,2,FALSE),IF(Sprache=\"Francais\",VLOOKUP(\"Wasserseitiger Druckverlust\",Legende!$B$3:$E$83,3,FALSE),0)))","v":"Wasserseitiger Druckverlust"},null,null,{"$f":" 0.00012417*E19*E19 + 0.0039185*E19","v":1.6335500000000001},null,null,null,null,null,null,null,null,{"$f":" 0.0001602529*E19*E19 + 0.0058849388*E19 - 0","v":2.1910228800000002},null,null,null,null,null,null,null,null,{"$f":" 0.00000002*E19*E19*E19 + 0.00018904*E19*E19 + 0.00726447*E19","v":2.6368470000000004}]
[]
[null,{"$f":"IF(Sprache=\"Deutsch\",VLOOKUP(\"Gesamt Heizleistung - Q\",Legende!$B$3:$E$83,1,FALSE),IF(Sprache=\"English\",VLOOKUP(\"Gesamt Heizleistung - Q\",Legende!$B$3:$E$83,2,FALSE),IF(Sprache=\"Francais\",VLOOKUP(\"Gesamt Heizleistung - Q\",Legende!$B$3:$E$83,3,FALSE),0)))","v":"Gesamt Heizleistung - Q"},null,null,{"$f":"'Hinterlegte Gleichungen'!AJ55","v":144.03237391690615},{"$f":"'Hinterlegte Gleichungen'!AJ56","v":395.06660428209523},{"$f":"'Hinterlegte Gleichungen'!AJ57","v":514.51961359235531},{"$f":"'Hinterlegte Gleichungen'!AJ59","v":492.58843397330764},{"$f":"'Hinterlegte Gleichungen'!AJ60","v":471.55312313997433},{"$f":"'Hinterlegte Gleichungen'!AJ61","v":529.35365636500296},{"$f":"'Hinterlegte Gleichungen'!AJ62","v":558.52446538662889},"W",null,{"$f":"'Hinterlegte Gleichungen'!O55","v":217.99857510645168},{"$f":"'Hinterlegte Gleichungen'!O56","v":597.97676802020987},{"$f":"'Hinterlegte Gleichungen'!O57","v":778.79988750013206},{"$f":"'Hinterlegte Gleichungen'!O59","v":744.12351550013204},{"$f":"'Hinterlegte Gleichungen'!O60","v":710.46701816679877},{"$f":"'Hinterlegte Gleichungen'!O61","v":794.48011303003705},{"$f":"'Hinterlegte Gleichungen'!O62","v":837.8301019754806},"W",null,{"$f":"'Hinterlegte Gleichungen'!BE55","v":268.76764274169574},{"$f":"'Hinterlegte Gleichungen'!BE56","v":737.24189877029437},{"$f":"'Hinterlegte Gleichungen'!BE57","v":960.34508406847999},{"$f":"'Hinterlegte Gleichungen'!BE59","v":917.70296683038464},{"$f":"'Hinterlegte Gleichungen'!BE60","v":876.15822793455141},{"$f":"'Hinterlegte Gleichungen'!BE61","v":978.54477721706576},{"$f":"'Hinterlegte Gleichungen'!BE62","v":1031.875975508573},"W"]
[null,{"$f":"IF(Sprache=\"Deutsch\",VLOOKUP(\"Schallleistungspegel - MQ Gerät\",Legende!$B$3:$E$83,1,FALSE),IF(Sprache=\"English\",VLOOKUP(\"Schallleistungspegel - MQ Gerät\",Legende!$B$3:$E$83,2,FALSE),IF(Sprache=\"Francais\",VLOOKUP(\"Schallleistungspegel - MQ Gerät\",Legende!$B$3:$E$83,3,FALSE),0)))","v":"Schallleistungspegel - MQ Gerät"},null,null,{"$f":"IF('Hinterlegte Gleichungen'!AC68>28,('Hinterlegte Gleichungen'!AC68),IF('Hinterlegte Gleichungen'!AC68<28,\"< 28\"))","v":"< 28"},{"$f":"IF('Hinterlegte Gleichungen'!AD68>28,('Hinterlegte Gleichungen'!AD68),IF('Hinterlegte Gleichungen'!AD68<28,\"< 28\"))","v":"< 28"},{"$f":"IF('Hinterlegte Gleichungen'!AE68>28,('Hinterlegte Gleichungen'!AE68),IF('Hinterlegte Gleichungen'!AE68<28,\"< 28\"))","v":"< 28"},{"$f":"IF('Hinterlegte Gleichungen'!AF68>28,('Hinterlegte Gleichungen'!AF68),IF('Hinterlegte Gleichungen'!AF68<28,\"< 28\"))","v":28.906296527044947},{"$f":"IF('Hinterlegte Gleichungen'!AG68>28,('Hinterlegte Gleichungen'!AG68),IF('Hinterlegte Gleichungen'!AG68<28,\"< 28\"))","v":31.358638928121596},{"$f":"IF('Hinterlegte Gleichungen'!AH68>28,('Hinterlegte Gleichungen'!AH68),IF('Hinterlegte Gleichungen'!AH68<28,\"< 28\"))","v":31.327776424157538},{"$f":"IF('Hinterlegte Gleichungen'!AI68>28,('Hinterlegte Gleichungen'!AI68),IF('Hinterlegte Gleichungen'!AI68<28,\"< 28\"))","v":31.094130954532357},"dB(A)",null,{"$f":"IF('Hinterlegte Gleichungen'!H68>28,('Hinterlegte Gleichungen'!H68),IF('Hinterlegte Gleichungen'!H68<28,\"< 28\"))","v":29.125283427196237},{"$f":"IF('Hinterlegte Gleichungen'!I68>28,('Hinterlegte Gleichungen'!I68),IF('Hinterlegte Gleichungen'!I68<28,\"< 28\"))","v":28.341039915907007},{"$f":"IF('Hinterlegte Gleichungen'!J68>28,('Hinterlegte Gleichungen'!J68),IF('Hinterlegte Gleichungen'!J68<28,\"< 28\"))","v":28.343902905835371},{"$f":"IF('Hinterlegte Gleichungen'!K68>28,('Hinterlegte Gleichungen'!K68),IF('Hinterlegte Gleichungen'!K68<28,\"< 28\"))","v":30.947496353604194},{"$f":"IF('Hinterlegte Gleichungen'!L68>28,('Hinterlegte Gleichungen'!L68),IF('Hinterlegte Gleichungen'!L68<28,\"< 28\"))","v":33.399838754680843},{"$f":"IF('Hinterlegte Gleichungen'!M68>28,('Hinterlegte Gleichungen'!M68),IF('Hinterlegte Gleichungen'!M68<28,\"< 28\"))","v":33.476214904634517},{"$f":"IF('Hinterlegte Gleichungen'!N68>28,('Hinterlegte Gleichungen'!N68),IF('Hinterlegte Gleichungen'!N68<28,\"< 28\"))","v":33.242569435009337},"dB(A)",null,{"$f":"IF('Hinterlegte Gleichungen'!AX68>28,('Hinterlegte Gleichungen'!AX68),IF('Hinterlegte Gleichungen'!AX68<28,\"< 28\"))","v":30.073146620978246},{"$f":"IF('Hinterlegte Gleichungen'!AY68>28,('Hinterlegte Gleichungen'!AY68),IF('Hinterlegte Gleichungen'!AY68<28,\"< 28\"))","v":29.268580448275994},{"$f":"IF('Hinterlegte Gleichungen'!AZ68>28,('Hinterlegte Gleichungen'!AZ68),IF('Hinterlegte Gleichungen'!AZ68<28,\"< 28\"))","v":29.271443438204358},{"$f":"IF('Hinterlegte Gleichungen'!BA68>28,('Hinterlegte Gleichungen'!BA68),IF('Hinterlegte Gleichungen'!BA68<28,\"< 28\"))","v":31.861967526669737},{"$f":"IF('Hinterlegte Gleichungen'!BB68>28,('Hinterlegte Gleichungen'!BB68),IF('Hinterlegte Gleichungen'!BB68<28,\"< 28\"))","v":34.314309927746386},{"$f":"IF('Hinterlegte Gleichungen'!BC68>28,('Hinterlegte Gleichungen'!BC68),IF('Hinterlegte Gleichungen'!BC68<28,\"< 28\"))","v":34.424078098416523},{"$f":"IF('Hinterlegte Gleichungen'!BD68>28,('Hinterlegte Gleichungen'!BD68),IF('Hinterlegte Gleichungen'!BD68<28,\"< 28\"))","v":34.190432628791342},"dB(A)"]
[null,{"$f":"IF(Sprache=\"Deutsch\",VLOOKUP(\"Schallleistungspegel - MQQ Gerät\",Legende!$B$3:$E$83,1,FALSE),IF(Sprache=\"English\",VLOOKUP(\"Schallleistungspegel - MQQ Gerät\",Legende!$B$3:$E$83,2,FALSE),IF(Sprache=\"Francais\",VLOOKUP(\"Schallleistungspegel - MQQ Gerät\",Legende!$B$3:$E$83,3,FALSE),0)))","v":"Schallleistungspegel - MQQ Gerät"},null,null,{"$f":"IF('Hinterlegte Gleichungen'!AC69>28,('Hinterlegte Gleichungen'!AC69),IF('Hinterlegte Gleichungen'!AC69,\"< 28\"))","v":"< 28"},{"$f":"IF('Hinterlegte Gleichungen'!AD69>28,('Hinterlegte Gleichungen'!AD69),IF('Hinterlegte Gleichungen'!AD69,\"< 28\"))","v":"< 28"},{"$f":"IF('Hinterlegte Gleichungen'!AE69>28,('Hinterlegte Gleichungen'!AE69),IF('Hinterlegte Gleichungen'!AE69,\"< 28\"))","v":"< 28"},{"$f":"IF('Hinterlegte Gleichungen'!AF69>28,('Hinterlegte Gleichungen'!AF69),IF('Hinterlegte Gleichungen'!AF69,\"< 28\"))","v":29.339600966743536},{"$f":"IF('Hinterlegte Gleichungen'!AG69>28,('Hinterlegte Gleichungen'!AG69),IF('Hinterlegte Gleichungen'!AG69,\"< 28\"))","v":33.531946111590692},{"$f":"IF('Hinterlegte Gleichungen'!AH69>28,('Hinterlegte Gleichungen'!AH69),IF('Hinterlegte Gleichungen'!AH69,\"< 28\"))","v":32.471558018191814},{"$f":"IF('Hinterlegte Gleichungen'!AI69>28,('Hinterlegte Gleichungen'!AI69),IF('Hinterlegte Gleichungen'!AI69,\"< 28\"))","v":32.107990993707062},"dB(A)",null,{"$f":"IF('Hinterlegte Gleichungen'!H69>28,('Hinterlegte Gleichungen'!H69),IF('Hinterlegte Gleichungen'!H69<28,\"< 28\"))","v":29.125283427196237},{"$f":"IF('Hinterlegte Gleichungen'!I69>28,('Hinterlegte Gleichungen'!I69),IF('Hinterlegte Gleichungen'!I69<28,\"< 28\"))","v":28.341039915907007},{"$f":"IF('Hinterlegte Gleichungen'!J69>28,('Hinterlegte Gleichungen'!J69),IF('Hinterlegte Gleichungen'!J69<28,\"< 28\"))","v":28.343902905835371},{"$f":"IF('Hinterlegte Gleichungen'!K69>28,('Hinterlegte Gleichungen'!K69),IF('Hinterlegte Gleichungen'!K69<28,\"< 28\"))","v":31.380800793302782},{"$f":"IF('Hinterlegte Gleichungen'!L69>28,('Hinterlegte Gleichungen'!L69),IF('Hinterlegte Gleichungen'!L69<28,\"< 28\"))","v":35.573145938149942},{"$f":"IF('Hinterlegte Gleichungen'!M69>28,('Hinterlegte Gleichungen'!M69),IF('Hinterlegte Gleichungen'!M69<28,\"< 28\"))","v":34.61999649866879},{"$f":"IF('Hinterlegte Gleichungen'!N69>28,('Hinterlegte Gleichungen'!N69),IF('Hinterlegte Gleichungen'!N69<28,\"< 28\"))","v":34.256429474184038},"dB(A)",null,{"$f":"IF('Hinterlegte Gleichungen'!AX69>28,('Hinterlegte Gleichungen'!AX69),IF('Hinterlegte Gleichungen'!AX69<28,\"< 28\"))","v":30.073146620978246},{"$f":"IF('Hinterlegte Gleichungen'!AY69>28,('Hinterlegte Gleichungen'!AY69),IF('Hinterlegte Gleichungen'!AY69<28,\"< 28\"))","v":29.268580448275994},{"$f":"IF('Hinterlegte Gleichungen'!AZ69>28,('Hinterlegte Gleichungen'!AZ69),IF('Hinterlegte Gleichungen'!AZ69<28,\"< 28\"))","v":29.271443438204358},{"$f":"IF('Hinterlegte Gleichungen'!BA69>28,('Hinterlegte Gleichungen'!BA69),IF('Hinterlegte Gleichungen'!BA69<28,\"< 28\"))","v":32.295271966368325},{"$f":"IF('Hinterlegte Gleichungen'!BB69>28,('Hinterlegte Gleichungen'!BB69),IF('Hinterlegte Gleichungen'!BB69<28,\"< 28\"))","v":36.487617111215485},{"$f":"IF('Hinterlegte Gleichungen'!BC69>28,('Hinterlegte Gleichungen'!BC69),IF('Hinterlegte Gleichungen'!BC69<28,\"< 28\"))","v":35.567859692450796},{"$f":"IF('Hinterlegte Gleichungen'!BD69>28,('Hinterlegte Gleichungen'!BD69),IF('Hinterlegte Gleichungen'!BD69<28,\"< 28\"))","v":35.204292667966044},"dB(A)"]
[null,null,null,null,null,null,null,null,null,null,{"$f":"IF(Sprache=\"Deutsch\",VLOOKUP(\"Toleranz +/- 3 dB\",Legende!$B$3:$E$83,1,FALSE),IF(Sprache=\"English\",VLOOKUP(\"Toleranz +/- 3 dB\",Legende!$B$3:$E$83,2,FALSE),IF(Sprache=\"Francais\",VLOOKUP(\"Toleranz +/- 3 dB\",Legende!$B$3:$E$83,3,FALSE),0)))","v":"Toleranz +/- 3 dB"},null,null,null,null,null,null,null,null,{"$f":"IF(Sprache=\"Deutsch\",VLOOKUP(\"Toleranz +/- 3 dB\",Legende!$B$3:$E$83,1,FALSE),IF(Sprache=\"English\",VLOOKUP(\"Toleranz +/- 3 dB\",Legende!$B$3:$E$83,2,FALSE),IF(Sprache=\"Francais\",VLOOKUP(\"Toleranz +/- 3 dB\",Legende!$B$3:$E$83,3,FALSE),0)))","v":"Toleranz +/- 3 dB"},null,null,null,null,null,null,null,null,{"$f":"IF(Sprache=\"Deutsch\",VLOOKUP(\"Toleranz +/- 3 dB\",Legende!$B$3:$E$83,1,FALSE),IF(Sprache=\"English\",VLOOKUP(\"Toleranz +/- 3 dB\",Legende!$B$3:$E$83,2,FALSE),IF(Sprache=\"Francais\",VLOOKUP(\"Toleranz +/- 3 dB\",Legende!$B$3:$E$83,3,FALSE),0)))","v":"Toleranz +/- 3 dB"}]
[]
[null,{"$f":"IF(Sprache=\"Deutsch\",VLOOKUP(\"Regelbereich\",Legende!$B$3:$E$83,1,FALSE),IF(Sprache=\"English\",VLOOKUP(\"Regelbereich\",Legende!$B$3:$E$83,2,FALSE),IF(Sprache=\"Francais\",VLOOKUP(\"Regelbereich\",Legende!$B$3:$E$83,3,FALSE),0)))","v":"Regelbereich"}]
[]
[null,null,{"$f":"IF(Sprache=\"Deutsch\",VLOOKUP(\"Leistung [W]\",Legende!$B$3:$E$83,1,FALSE),IF(Sprache=\"English\",VLOOKUP(\"Leistung [W]\",Legende!$B$3:$E$83,2,FALSE),IF(Sprache=\"Francais\",VLOOKUP(\"Leistung [W]\",Legende!$B$3:$E$83,3,FALSE),0)))","v":"Leistung [W]"},null,null,null,null,null,null,null,null,null,null,null,null,null,null,null,null,null,null,null,null,null,null,null,null,null,null,{"$f":"IF(Sprache=\"Deutsch\",VLOOKUP(\"Schallleistungspegel [dB(A)]\",Legende!$B$3:$E$83,1,FALSE),IF(Sprache=\"English\",VLOOKUP(\"Schallleistungspegel [dB(A)]\",Legende!$B$3:$E$83,2,FALSE),IF(Sprache=\"Francais\",VLOOKUP(\"Schallleistungspegel [dB(A)]\",Legende!$B$3:$E$83,3,FALSE),0)))","v":"Schallleistungspegel [dB(A)]"}]
[]
[]
[]
[]
[]
[]
[]
[]
[]
[null,null,null,null,null,{"$f":"IF(Sprache=\"Deutsch\",VLOOKUP(\"Primärvolumenstrom - Vp [m³/h]\",Legende!$B$3:$E$83,1,FALSE),IF(Sprache=\"English\",VLOOKUP(\"Primärvolumenstrom - Vp [m³/h]\",Legende!$B$3:$E$83,2,FALSE),IF(Sprache=\"Francais\",VLOOKUP(\"Primärvolumenstrom - Vp [m³/h]\",Legende!$B$3:$E$83,3,FALSE),0)))","v":"Primärvolumenstrom - Vp [m³/h]"},null,null,null,null,null,null,null,null,{"$f":"IF(Sprache=\"Deutsch\",VLOOKUP(\"Primärvolumenstrom - Vp [m³/h]\",Legende!$B$3:$E$83,1,FALSE),IF(Sprache=\"English\",VLOOKUP(\"Primärvolumenstrom - Vp [m³/h]\",Legende!$B$3:$E$83,2,FALSE),IF(Sprache=\"Francais\",VLOOKUP(\"Primärvolumenstrom - Vp [m³/h]\",Legende!$B$3:$E$83,3,FALSE),0)))","v":"Primärvolumenstrom - Vp [m³/h]"},null,null,null,null,null,null,null,null,{"$f":"IF(Sprache=\"Deutsch\",VLOOKUP(\"Primärvolumenstrom - Vp [m³/h]\",Legende!$B$3:$E$83,1,FALSE),IF(Sprache=\"English\",VLOOKUP(\"Primärvolumenstrom - Vp [m³/h]\",Legende!$B$3:$E$83,2,FALSE),IF(Sprache=\"Francais\",VLOOKUP(\"Primärvolumenstrom - Vp [m³/h]\",Legende!$B$3:$E$83,3,FALSE),0)))","v":"Primärvolumenstrom - Vp [m³/h]"}]
[]
[null,null,null,null,null,null,{"$f":"IF(Sprache=\"Deutsch\",VLOOKUP(\"Primärleistung\",Legende!$B$3:$E$83,1,FALSE),IF(Sprache=\"English\",VLOOKUP(\"Primärleistung\",Legende!$B$3:$E$83,2,FALSE),IF(Sprache=\"Francais\",VLOOKUP(\"Primärleistung\",Legende!$B$3:$E$83,3,FALSE),0)))","v":"Primärleistung"},null,null,null,null,null,null,null,null,{"$f":"IF(Sprache=\"Deutsch\",VLOOKUP(\"Primärleistung\",Legende!$B$3:$E$83,1,FALSE),IF(Sprache=\"English\",VLOOKUP(\"Primärleistung\",Legende!$B$3:$E$83,2,FALSE),IF(Sprache=\"Francais\",VLOOKUP(\"Primärleistung\",Legende!$B$3:$E$83,3,FALSE),0)))","v":"Primärleistung"},null,null,null,null,null,null,null,null,{"$f":"IF(Sprache=\"Deutsch\",VLOOKUP(\"Primärleistung\",Legende!$B$3:$E$83,1,FALSE),IF(Sprache=\"English\",VLOOKUP(\"Primärleistung\",Legende!$B$3:$E$83,2,FALSE),IF(Sprache=\"Francais\",VLOOKUP(\"Primärleistung\",Legende!$B$3:$E$83,3,FALSE),0)))","v":"Primärleistung"}]
[null,null,null,null,null,null,{"$f":"IF(Sprache=\"Deutsch\",VLOOKUP(\"Sekundärleistung\",Legende!$B$3:$E$83,1,FALSE),IF(Sprache=\"English\",VLOOKUP(\"Sekundärleistung\",Legende!$B$3:$E$83,2,FALSE),IF(Sprache=\"Francais\",VLOOKUP(\"Sekundärleistung\",Legende!$B$3:$E$83,3,FALSE),0)))","v":"Sekundärleistung"},null,null,null,null,null,null,null,null,{"$f":"IF(Sprache=\"Deutsch\",VLOOKUP(\"Sekundärleistung\",Legende!$B$3:$E$83,1,FALSE),IF(Sprache=\"English\",VLOOKUP(\"Sekundärleistung\",Legende!$B$3:$E$83,2,FALSE),IF(Sprache=\"Francais\",VLOOKUP(\"Sekundärleistung\",Legende!$B$3:$E$83,3,FALSE),0)))","v":"Sekundärleistung"},null,null,null,null,null,null,null,null,{"$f":"IF(Sprache=\"Deutsch\",VLOOKUP(\"Sekundärleistung\",Legende!$B$3:$E$83,1,FALSE),IF(Sprache=\"English\",VLOOKUP(\"Sekundärleistung\",Legende!$B$3:$E$83,2,FALSE),IF(Sprache=\"Francais\",VLOOKUP(\"Sekundärleistung\",Legende!$B$3:$E$83,3,FALSE),0)))","v":"Sekundärleistung"}]
[null,null,null,null,null,null,{"$f":"IF(Sprache=\"Deutsch\",VLOOKUP(\"Gesamt Heizleistung\",Legende!$B$3:$E$83,1,FALSE),IF(Sprache=\"English\",VLOOKUP(\"Gesamt Heizleistung\",Legende!$B$3:$E$83,2,FALSE),IF(Sprache=\"Francais\",VLOOKUP(\"Gesamt Heizleistung\",Legende!$B$3:$E$83,3,FALSE),0)))","v":"Gesamt Heizleistung"},null,null,null,null,null,null,null,null,{"$f":"IF(Sprache=\"Deutsch\",VLOOKUP(\"Gesamt Heizleistung\",Legende!$B$3:$E$83,1,FALSE),IF(Sprache=\"English\",VLOOKUP(\"Gesamt Heizleistung\",Legende!$B$3:$E$83,2,FALSE),IF(Sprache=\"Francais\",VLOOKUP(\"Gesamt Heizleistung\",Legende!$B$3:$E$83,3,FALSE),0)))","v":"Gesamt Heizleistung"},null,null,null,null,null,null,null,null,{"$f":"IF(Sprache=\"Deutsch\",VLOOKUP(\"Gesamt Heizleistung\",Legende!$B$3:$E$83,1,FALSE),IF(Sprache=\"English\",VLOOKUP(\"Gesamt Heizleistung\",Legende!$B$3:$E$83,2,FALSE),IF(Sprache=\"Francais\",VLOOKUP(\"Gesamt Heizleistung\",Legende!$B$3:$E$83,3,FALSE),0)))","v":"Gesamt Heizleistung"}]
[]
[]
[null,{"$f":"IF(Sprache=\"Deutsch\",VLOOKUP(\"© LTG Aktiengesellschaft - Letzte Änderung: 13.03.2012\",Legende!$B$3:$E$83,1,FALSE),IF(Sprache=\"English\",VLOOKUP(\"© LTG Aktiengesellschaft - Letzte Änderung: 13.03.2012\",Legende!$B$3:$E$83,2,FALSE),IF(Sprache=\"Francais\",VLOOKUP(\"© LTG Aktiengesellschaft - Letzte Änderung: 13.03.2012\",Legende!$B$3:$E$83,3,FALSE),0)))","v":"© LTG Aktiengesellschaft - Letzte Änderung: 13.03.2012"}]
[null,{"$f":"IF(Sprache=\"Deutsch\",VLOOKUP(\"Angaben zu Toleranzen sowie weitere Spezifikationen sind der aktuellen LTG Bauteilmappe zu entnehmen.\",Legende!$B$3:$E$83,1,FALSE),IF(Sprache=\"English\",VLOOKUP(\"Angaben zu Toleranzen sowie weitere Spezifikationen sind der aktuellen LTG Bauteilmappe zu entnehmen.\",Legende!$B$3:$E$83,2,FALSE),IF(Sprache=\"Francais\",VLOOKUP(\"Angaben zu Toleranzen sowie weitere Spezifikationen sind der aktuellen LTG Bauteilmappe zu entnehmen.\",Legende!$B$3:$E$83,3,FALSE),0)))","v":"Angaben zu Toleranzen sowie weitere Spezifikationen sind der aktuellen LTG Bauteilmappe zu entnehmen."}]
[null,{"$f":"IF(Sprache=\"Deutsch\",VLOOKUP(\"Eine Fehlerfreiheit des Programms kann nicht zugesichert werden. Im Zweifel gelten die technischen Daten der aktuellen LTG Bauteilmappe.\",Legende!$B$3:$E$83,1,FALSE),IF(Sprache=\"English\",VLOOKUP(\"Eine Fehlerfreiheit des Programms kann nicht zugesichert werden. Im Zweifel gelten die technischen Daten der aktuellen LTG Bauteilmappe.\",Legende!$B$3:$E$83,2,FALSE),IF(Sprache=\"Francais\",VLOOKUP(\"Eine Fehlerfreiheit des Programms kann nicht zugesichert werden. Im Zweifel gelten die technischen Daten der aktuellen LTG Bauteilmappe.\",Legende!$B$3:$E$83,3,FALSE),0)))","v":"Eine Fehlerfreiheit des Programms kann nicht zugesichert werden. Im Zweifel gelten die technischen Daten der aktuellen LTG Bauteilmappe."}]
[null,{"$f":"IF(Sprache=\"Deutsch\",VLOOKUP(\"Aus Programmierfehlern entstandener Schaden geht nicht zu Lasten der LTG. Technische Änderungen im Rahmen der Weiterentwicklung vorbehalten.\",Legende!$B$3:$E$83,1,FALSE),IF(Sprache=\"English\",VLOOKUP(\"Aus Programmierfehlern entstandener Schaden geht nicht zu Lasten der LTG. Technische Änderungen im Rahmen der Weiterentwicklung vorbehalten.\",Legende!$B$3:$E$83,2,FALSE),IF(Sprache=\"Francais\",VLOOKUP(\"Aus Programmierfehlern entstandener Schaden geht nicht zu Lasten der LTG. Technische Änderungen im Rahmen der Weiterentwicklung vorbehalten.\",Legende!$B$3:$E$83,3,FALSE),0)))","v":"Aus Programmierfehlern entstandener Schaden geht nicht zu Lasten der LTG. Technische Änderungen im Rahmen der Weiterentwicklung vorbehalten."}]

{"sheet":"Hinterlegte Gleichungen","index":2,"n_rows":150,"n_cols":63,"rows_kept":150,"cut":false,"hidden":true,"merged":[[6,5,8,8],[6,15,8,18],[90,1,90,3],[90,4,90,6],[90,7,90,9],[90,10,90,12],[90,13,90,15],[90,16,90,18],[82,16,82,18],[83,1,83,3],[74,1,74,3],[74,4,74,6],[74,7,74,9],[74,10,74,12],[74,13,74,15],[91,1,91,3],[91,4,91,6],[91,7,91,9],[91,10,91,12],[91,13,91,15],[82,1,82,3],[82,4,82,6],[82,7,82,9],[82,10,82,12],[82,13,82,15],[75,1,75,3],[75,4,75,6],[75,7,75,9],[75,10,75,12],[75,13,75,15],[83,4,83,6],[83,7,83,9],[83,10,83,12],[83,13,83,15],[10,27,10,29],[101,16,101,18],[102,16,102,18],[109,16,109,18],[75,16,75,18],[83,16,83,18],[84,13,84,15],[84,16,84,18],[74,16,74,18],[102,13,102,15],[85,16,85,18],[86,13,86,15],[86,16,86,18],[91,16,91,18],[87,13,87,15],[87,16,87,18],[110,16,110,18],[117,16,117,18],[118,16,118,18],[112,16,112,18],[111,16,111,18],[113,16,113,18],[114,16,114,18],[109,13,109,15],[101,13,101,15],[110,7,110,9],[110,13,110,15],[117,13,117,15],[118,13,118,15],[111,13,111,15],[112,13,112,15],[113,13,113,15],[114,13,114,15],[85,13,85,15],[117,1,117,3],[118,1,118,3],[117,4,117,6],[117,7,117,9],[118,4,118,6],[128,7,128,9],[102,10,102,12],[109,10,109,12],[101,10,101,12],[101,1,101,3],[102,1,102,3],[101,4,101,6],[102,4,102,6],[101,7,101,9],[102,7,102,9],[117,10,117,12],[118,10,118,12],[118,7,118,9],[110,10,110,12],[109,1,109,3],[109,4,109,6],[109,7,109,9],[110,1,110,3],[110,4,110,6],[128,10,128,12],[138,13,138,15],[138,16,138,18],[139,13,139,15],[139,16,139,18],[128,13,128,15],[128,16,128,18],[129,1,129,3],[129,4,129,6],[129,7,129,9],[129,10,129,12],[129,13,129,15],[129,16,129,18],[128,1,128,3],[128,4,128,6],[145,16,145,18],[145,1,145,3],[145,4,145,6],[145,7,145,9],[145,10,145,12],[145,13,145,15],[140,13,140,15],[140,16,140,18],[136,16,136,18],[137,1,137,3],[137,4,137,6],[137,7,137,9],[137,10,137,12],[137,13,137,15],[137,16,137,18],[136,1,136,3],[141,13,141,15],[141,16,141,18],[144,1,144,3],[144,4,144,6],[144,7,144,9],[144,10,144,12],[144,13,144,15],[144,16,144,18],[136,4,136,6],[136,7,136,9],[136,10,136,12],[136,13,136,15]]}
["Auslegeprogramm  und Technische Daten HFVsf 4 / BG 630, 800 und 1000 / M2 / MQ oder MQQ"]
["CER/ND - Stand 02-2012"]
[]
[null,"Kühlen",null,null,"Einstellbereich:",null,null,null,null,null,null,"Heizen",null,null,"Einstellbereich:"]
[null,"Primärdruck",{"$f":"'HFVsf-_-4 - Kühlen'!E18","v":100},"Pa","50...150",null,null,null,null,null,null,"Primärdruck",{"$f":"'HFVsf-_-4 - Heizen'!E14","v":100},"Pa","50...150"]
[{"$f":"'HFVsf-_-4 - Kühlen'!E23*100/120","v":100},"wk",{"$f":"'HFVsf-_-4 - Kühlen'!E23","v":120},"kg/h","30...300",null,null,null,null,null,{"$f":"'HFVsf-_-4 - Heizen'!E19*100/100","v":100},"wh",{"$f":"'HFVsf-_-4 - Heizen'!E19","v":100},"kg/h","10...160"]
[null,"T_VL",{"$f":"'HFVsf-_-4 - Kühlen'!E22","v":16},"°C","?","Achtung! Die Primärlufttemperatur soll nicht 18°C unterschreiten",null,null,null,null,null,"T_VL",{"$f":"'HFVsf-_-4 - Heizen'!E18","v":55},"°C","30...60","Achtung! die Primärlufttemperatur soll nicht 18°C unterschreiten"]
[null,"T_Raum",{"$f":"'HFVsf-_-4 - Kühlen'!E11","v":26},"°C","?",null,null,null,null,null,{"$f":"'HFVsf-_-4 - Heizen'!E18-'HFVsf-_-4 - Heizen'!E11","v":33},"T_Raum",{"$f":"'HFVsf-_-4 - Heizen'!E11","v":22},"°C","?"]
[null,"T_Primärluft",{"$f":"'HFVsf-_-4 - Kühlen'!E19","v":19},"°C","18...30",null,null,null,null,null,null,"T_Primärluft",{"$f":"'HFVsf-_-4 - Heizen'!E15","v":18},"°C","18...30"]
[]
[]
[]
[]
[]
[]
[]
[]
[]
[]
[]
[]
[]
[]
[]
[]
[]
[]
[]
[]
[]
[]
[]
[]
[]
[]
[]
[]
[null,"BG800 - Kühlen",null,null,null,null,null,null,null,null,null,null,null,null,null,null,null,null,null,null,null,null,"BG630 - Kühlen",null,null,null,null,null,null,null,null,null,null,null,null,null,null,null,null,null,null,null,null,"BG1000 - Kühlen"]
[null,null,null,null,null,"Dp","VP","LwA","LwA","Qp","QP/DtP","Qk/Dt_Nenn","Qk/Dt","Qk","Qk Gesamt",null,"TRL","DT_Wasser",null,null,null,null,null,null,null,null,"Dp","VP","LwA","LwA","Qp","QP/DtP",null,"Qk/Dt","Qk","Qk Gesamt",null,"TRL","DT_Wasser",null,null,null,null,null,null,null,null,"Dp","VP","LwA","LwA","Qp","QP/DtP",null,"Qk/Dt","Qk","Qk Gesamt",null,"TRL","DT_Wasser"]
[null,"Dp W.",{"$f":" 0.00064443*'HFVsf-_-4 - Kühlen'!E23*'HFVsf-_-4 - Kühlen'!E23 + 0.00352314*'HFVsf-_-4 - Kühlen'!E23","v":9.7025687999999999},"kPa",null,"Pa","m³/h","MQ","MQQ","W","W/K","W/K","W/K","W","W",null,"°C","K",null,null,null,null,"Dp W.",{"$f":" 0.00000011*'HFVsf-_-4 - Kühlen'!$E$23*'HFVsf-_-4 - Kühlen'!$E$23*'HFVsf-_-4 - Kühlen'!$E$23 + 0.00052479*'HFVsf-_-4 - Kühlen'!$E$23*'HFVsf-_-4 - Kühlen'!$E$23 + 0.0035756*'HFVsf-_-4 - Kühlen'!$E$23","v":8.1761280000000003},"kPa",null,"Pa","m³/h","MQ","MQQ","W","W/K",null,"W/K","W","W",null,"°C","K",null,null,null,null,"Dp W.",{"$f":" -0.00000004*'HFVsf-_-4 - Kühlen'!$E$23*'HFVsf-_-4 - Kühlen'!$E$23*'HFVsf-_-4 - Kühlen'!$E$23 + 0.00072215*'HFVsf-_-4 - Kühlen'!$E$23*'HFVsf-_-4 - Kühlen'!$E$23 + 0.00628999*'HFVsf-_-4 - Kühlen'!$E$23","v":11.0846388},"kPa",null,"Pa","m³/h","MQ","MQQ","W","W/K",null,"W/K","W","W",null,"°C","K"]
[null,"Düsenreihen:",null,null,null,{"$f":"'HFVsf-_-4 - Kühlen'!$E$18","v":100},null,null,null,null,null,"120 L/h",null,null,null,null,null,null,null,"! ? !",null,null,"Düsenreihen:",null,null,null,{"$f":"'HFVsf-_-4 - Kühlen'!$E$18","v":100},null,null,null,null,null,null,null,null,null,null,null,null,null,"! ? !",null,null,"Düsenreihen:",null,null,null,{"$f":"'HFVsf-_-4 - Kühlen'!$E$18","v":100},null,null,null,null,null,null,null,null,null,null,null,null,null,"! ? !"]
["V0","geschlossen",null,null,null,null,{"$f":" 0.0000012*'HFVsf-_-4 - Kühlen'!E18*'HFVsf-_-4 - Kühlen'!E18*'HFVsf-_-4 - Kühlen'!E18 - 0.00056156*'HFVsf-_-4 - Kühlen'!E18*'HFVsf-_-4 - Kühlen'!E18 + 0.11947194*'HFVsf-_-4 - Kühlen'!E18","v":7.5315940000000001},{"$f":" -0.09683515*G42*G42*G42 + 2.82937202*G42*G42 - 25.31985844*G42 + 100.69909147","v":29.125283427196237},{"$f":"  -0.09683515*G42*G42*G42 + 2.82937202*G42*G42 - 25.31985844*G42 + 100.69909147","v":29.125283427196237},{"$f":"(G42*('HFVsf-_-4 - Kühlen'!$E$19-'HFVsf-_-4 - Kühlen'!$E$11)/3)*-1","v":17.573719333333333},{"$f":"J42/('HFVsf-_-4 - Kühlen'!$E$11-'HFVsf-_-4 - Kühlen'!$E$19)","v":2.5105313333333332},0,{"$f":" (-0.00000005*$A$6*$A$6*$A$6*$A$6 + 0.00003436*$A$6*$A$6*$A$6 - 0.00954651*$A$6*$A$6 + 1.23090664*$A$6 + 42.5961506)*(L42/100)","v":0},{"$f":"M42*('HFVsf-_-4 - Kühlen'!$E$22-'HFVsf-_-4 - Kühlen'!$E$11)","v":0},{"$f":"N42+J42","v":17.573719333333333},null,{"$f":"((N42*3.6)+('HFVsf-_-4 - Kühlen'!$E$23*4.19*'HFVsf-_-4 - Kühlen'!$E$22))/('HFVsf-_-4 - Kühlen'!$E$23*4.19)","v":16},{"$f":"Q42-'HFVsf-_-4 - Kühlen'!$E$22","v":0},null,{"$f":"G42/0.8","v":9.4144924999999997},{"$f":"IF(T42>75,$T$41,$U$41)","v":0},"V0","geschlossen",null,null,null,null,{"$f":"G42/$AL$84*$AM$84","v":4.5924353658536585},{"$f":"H42+(10*LOG($AM$84/$AL$84))","v":26.976844946719257},{"$f":"I42+(10*LOG($AM$84/$AL$84))","v":26.976844946719257},{"$f":"(AB42*('HFVsf-_-4 - Kühlen'!$E$19-'HFVsf-_-4 - Kühlen'!$E$11)/3)*-1","v":10.715682520325203},{"$f":"AE42/('HFVsf-_-4 - Kühlen'!$E$11-'HFVsf-_-4 - Kühlen'!$E$19)","v":1.530811788617886},null,{"$f":" (M42/$AL$86*$AM$86)*0.9","v":0},{"$f":"AH42*('HFVsf-_-4 - Kühlen'!$E$22-'HFVsf-_-4 - Kühlen'!$E$11)","v":0},{"$f":"AI42+AE42","v":10.715682520325203},null,{"$f":"((AI42*3.6)+('HFVsf-_-4 - Kühlen'!$E$23*4.19*'HFVsf-_-4 - Kühlen'!$E$22))/('HFVsf-_-4 - Kühlen'!$E$23*4.19)","v":16},{"$f":"AL42-'HFVsf-_-4 - Kühlen'!$E$22","v":0},null,{"$f":"AB42/0.63","v":7.2895799457994581},{"$f":"IF(AO42>75,$T$41,$U$41)","v":0},"V0","geschlossen",null,null,null,null,{"$f":"G42/$AL$84*$AN$84","v":9.3685681463414632},{"$f":"H42+(10*LOG($AN$84/$AL$84))","v":30.073146620978246},{"$f":"I42+(10*LOG($AN$84/$AL$84))","v":30.073146620978246},{"$f":"(AW42*('HFVsf-_-4 - Kühlen'!$E$19-'HFVsf-_-4 - Kühlen'!$E$11)/3)*-1","v":21.859992341463414},{"$f":"AZ42/('HFVsf-_-4 - Kühlen'!$E$11-'HFVsf-_-4 - Kühlen'!$E$19)","v":3.1228560487804877},null,{"$f":" (M42/$AL$86*$AN$86)","v":0},{"$f":"BC42*('HFVsf-_-4 - Kühlen'!$E$22-'HFVsf-_-4 - Kühlen'!$E$11)","v":0},{"$f":"BD42+AZ42","v":21.859992341463414},null,{"$f":"((BD42*3.6)+('HFVsf-_-4 - Kühlen'!$E$23*4.19*'HFVsf-_-4 - Kühlen'!$E$22))/('HFVsf-_-4 - Kühlen'!$E$23*4.19)","v":16},{"$f":"BG42-'HFVsf-_-4 - Kühlen'!$E$22","v":0},null,{"$f":"AW42/1","v":9.3685681463414632},{"$f":"IF(BJ42>75,$T$41,$U$41)","v":0}]
["V1","Reihe 1 - halb offen",null,null,null,null,{"$f":" 0.0000037*'HFVsf-_-4 - Kühlen'!E18*'HFVsf-_-4 - Kühlen'!E18*'HFVsf-_-4 - Kühlen'!E18 - 0.00170264*'HFVsf-_-4 - Kühlen'!E18*'HFVsf-_-4 - Kühlen'!E18 + 0.33699235*'HFVsf-_-4 - Kühlen'!E18","v":20.372835000000002},{"$f":" 0.00318987*G43*G43*G43 - 0.20009878*G43*G43 + 4.44969236*G43 - 6.23321246","v":28.341039915907007},{"$f":" 0.00318987*G43*G43*G43 - 0.20009878*G43*G43 + 4.44969236*G43 - 6.23321246","v":28.341039915907007},{"$f":"(G43*('HFVsf-_-4 - Kühlen'!$E$19-'HFVsf-_-4 - Kühlen'!$E$11)/3)*-1","v":47.536615000000005},{"$f":"J43/('HFVsf-_-4 - Kühlen'!$E$11-'HFVsf-_-4 - Kühlen'!$E$19)","v":6.7909450000000007},{"$f":" -0.00016284*'HFVsf-_-4 - Kühlen'!E18*'HFVsf-_-4 - Kühlen'!E18 + 0.13240544*'HFVsf-_-4 - Kühlen'!E18 + 8.7971089","v":20.409252899999998},{"$f":" (-0.00000005*$A$6*$A$6*$A$6*$A$6 + 0.00003436*$A$6*$A$6*$A$6 - 0.00954651*$A$6*$A$6 + 1.23090664*$A$6 + 42.5961506)*(L43/100)","v":20.323883974870224},{"$f":"M43*('HFVsf-_-4 - Kühlen'!$E$11-'HFVsf-_-4 - Kühlen'!$E$22)","v":203.23883974870225},{"$f":"N43+J43","v":250.77545474870226},null,{"$f":"((N43*3.6)+('HFVsf-_-4 - Kühlen'!$E$23*4.19*'HFVsf-_-4 - Kühlen'!$E$22))/('HFVsf-_-4 - Kühlen'!$E$23*4.19)","v":17.455170690324834},{"$f":"Q43-'HFVsf-_-4 - Kühlen'!$E$22","v":1.4551706903248345},null,{"$f":"G43/0.8","v":25.466043750000001},{"$f":"IF(T43>75,$T$41,$U$41)","v":0},"V1","Reihe 1 - halb offen",null,null,null,null,{"$f":"G43/$AL$84*$AM$84","v":12.422460365853659},{"$f":"H43+(10*LOG($AM$77/$AL$77))","v":26.258280491636182},{"$f":"I43+(10*LOG($AM$77/$AL$77))","v":26.258280491636182},{"$f":"(AB43*('HFVsf-_-4 - Kühlen'!$E$19-'HFVsf-_-4 - Kühlen'!$E$11)/3)*-1","v":28.985740853658541},{"$f":"AE43/('HFVsf-_-4 - Kühlen'!$E$11-'HFVsf-_-4 - Kühlen'!$E$19)","v":4.1408201219512204},null,{"$f":" (M43/$AL$86*$AM$86)*0.9","v":13.382459424759938},{"$f":"AH43*('HFVsf-_-4 - Kühlen'!$E$11-'HFVsf-_-4 - Kühlen'!$E$22)","v":133.82459424759938},{"$f":"AI43+AE43","v":162.81033510125792},null,{"$f":"((AI43*3.6)+('HFVsf-_-4 - Kühlen'!$E$23*4.19*'HFVsf-_-4 - Kühlen'!$E$22))/('HFVsf-_-4 - Kühlen'!$E$23*4.19)","v":16.95817131919522},{"$f":"AL43-'HFVsf-_-4 - Kühlen'!$E$22","v":0.9581713191952197},null,{"$f":"AB43/0.63","v":19.71819105691057},{"$f":"IF(AO43>75,$T$41,$U$41)","v":0},"V1","Reihe 1 - halb offen",null,null,null,null,{"$f":"G43/$AL$84*$AN$84","v":25.341819146341468},{"$f":"H43+(10*LOG($AN$77/$AL$77))","v":29.268580448275994},{"$f":"I43+(10*LOG($AN$77/$AL$77))","v":29.268580448275994},{"$f":"(AW43*('HFVsf-_-4 - Kühlen'!$E$19-'HFVsf-_-4 - Kühlen'!$E$11)/3)*-1","v":59.130911341463424},{"$f":"AZ43/('HFVsf-_-4 - Kühlen'!$E$11-'HFVsf-_-4 - Kühlen'!$E$19)","v":8.4472730487804899},null,25.066914074023135,{"$f":"BC43*('HFVsf-_-4 - Kühlen'!$E$11-'HFVsf-_-4 - Kühlen'!$E$22)","v":250.66914074023134},309.80005208169479,null,{"$f":"((BD43*3.6)+('HFVsf-_-4 - Kühlen'!$E$23*4.19*'HFVsf-_-4 - Kühlen'!$E$22))/('HFVsf-_-4 - Kühlen'!$E$23*4.19)","v":17.794767117471821},{"$f":"BG43-'HFVsf-_-4 - Kühlen'!$E$22","v":1.7947671174718209},null,{"$f":"AW43/1","v":25.341819146341468},{"$f":"IF(BJ43>75,$T$41,$U$41)","v":0}]
["V2","Reihe 1 - offen",null,null,null,null,{"$f":" 0.00000518*'HFVsf-_-4 - Kühlen'!E18*'HFVsf-_-4 - Kühlen'!E18*'HFVsf-_-4 - Kühlen'!E18- 0.00258029*'HFVsf-_-4 - Kühlen'!E18*'HFVsf-_-4 - Kühlen'!E18 + 0.53187237*'HFVsf-_-4 - Kühlen'!E18","v":32.564336999999995},{"$f":" 0.00079259*G44*G44*G44 - 0.06598958*G44*G44 + 1.90619065*G44 + 8.87776506","v":28.343902905835371},{"$f":" 0.00079259*G44*G44*G44 - 0.06598958*G44*G44 + 1.90619065*G44 + 8.87776506","v":28.343902905835371},{"$f":"(G44*('HFVsf-_-4 - Kühlen'!$E$19-'HFVsf-_-4 - Kühlen'!$E$11)/3)*-1","v":75.983452999999983},{"$f":"J44/('HFVsf-_-4 - Kühlen'!$E$11-'HFVsf-_-4 - Kühlen'!$E$19)","v":10.854778999999997},{"$f":" -0.0006401*'HFVsf-_-4 - Kühlen'!E18*'HFVsf-_-4 - Kühlen'!E18 + 0.28808731*'HFVsf-_-4 - Kühlen'!E18 + 7.85269878","v":30.260429779999999},30.133854820253006,{"$f":"M44*('HFVsf-_-4 - Kühlen'!$E$11-'HFVsf-_-4 - Kühlen'!$E$22)","v":301.33854820253009},377.32200120253009,null,{"$f":"((N44*3.6)+('HFVsf-_-4 - Kühlen'!$E$23*4.19*'HFVsf-_-4 - Kühlen'!$E$22))/('HFVsf-_-4 - Kühlen'!$E$23*4.19)","v":18.157555237726946},{"$f":"Q44-'HFVsf-_-4 - Kühlen'!$E$22","v":2.157555237726946},null,40.705421249999993,0,"V2","Reihe 1 - offen",null,null,null,null,{"$f":"G44/$AL$77*$AM$77","v":20.158875285714281},{"$f":"H44+(10*LOG($AM$77/$AL$77))","v":26.261143481564545},{"$f":"I44+(10*LOG($AM$77/$AL$77))","v":26.261143481564545},{"$f":"(AB44*('HFVsf-_-4 - Kühlen'!$E$19-'HFVsf-_-4 - Kühlen'!$E$11)/3)*-1","v":47.037375666666655},{"$f":"AE44/('HFVsf-_-4 - Kühlen'!$E$11-'HFVsf-_-4 - Kühlen'!$E$19)","v":6.7196250952380936},null,19.841930309298448,{"$f":"AH44*('HFVsf-_-4 - Kühlen'!$E$11-'HFVsf-_-4 - Kühlen'!$E$22)","v":198.41930309298448},245.45667875965114,null,{"$f":"((AI44*3.6)+('HFVsf-_-4 - Kühlen'!$E$23*4.19*'HFVsf-_-4 - Kühlen'!$E$22))/('HFVsf-_-4 - Kühlen'!$E$23*4.19)","v":17.420663267968862},{"$f":"AL44-'HFVsf-_-4 - Kühlen'!$E$22","v":1.4206632679688624},null,31.998214739229017,0,"V2","Reihe 1 - offen",null,null,null,null,{"$f":"G44/$AL$77*$AN$77","v":40.317750571428562},{"$f":"H44+(10*LOG($AN$77/$AL$77))","v":29.271443438204358},{"$f":"I44+(10*LOG($AN$77/$AL$77))","v":29.271443438204358},{"$f":"(AW44*('HFVsf-_-4 - Kühlen'!$E$19-'HFVsf-_-4 - Kühlen'!$E$11)/3)*-1","v":94.07475133333331},{"$f":"AZ44/('HFVsf-_-4 - Kühlen'!$E$11-'HFVsf-_-4 - Kühlen'!$E$19)","v":13.439250190476187},null,37.16625967912185,{"$f":"BC44*('HFVsf-_-4 - Kühlen'!$E$11-'HFVsf-_-4 - Kühlen'!$E$22)","v":371.6625967912185},465.73734812455183,null,{"$f":"((BD44*3.6)+('HFVsf-_-4 - Kühlen'!$E$23*4.19*'HFVsf-_-4 - Kühlen'!$E$22))/('HFVsf-_-4 - Kühlen'!$E$23*4.19)","v":18.661068712108964},{"$f":"BG44-'HFVsf-_-4 - Kühlen'!$E$22","v":2.661068712108964},null,40.317750571428562,0]
["-","Reihe 1 - offen / Reihe 3+4 - 1/3 offen",null,null,null,null,{"$f":" 0.00001155*'HFVsf-_-4 - Kühlen'!E18*'HFVsf-_-4 - Kühlen'!E18*'HFVsf-_-4 - Kühlen'!E18 - 0.00512238*'HFVsf-_-4 - Kühlen'!E18*'HFVsf-_-4 - Kühlen'!E18 + 0.91013502*'HFVsf-_-4 - Kühlen'!E18","v":51.339702000000003},{"$f":" 0.01223661*G45*G45 - 1.10949158*G45 + 53.49366493 +1.5","v":30.285526215669293},{"$f":" 0.00940726*G45*G45- 0.71447208*G45 + 40.76970681","v":28.884249803009126},{"$f":"(G45*('HFVsf-_-4 - Kühlen'!$E$19-'HFVsf-_-4 - Kühlen'!$E$11)/3)*-1","v":119.79263800000001},{"$f":"J45/('HFVsf-_-4 - Kühlen'!$E$11-'HFVsf-_-4 - Kühlen'!$E$19)","v":17.113234000000002},{"$f":"L44","v":30.260429779999999},30.133854820253006,{"$f":"M45*('HFVsf-_-4 - Kühlen'!$E$11-'HFVsf-_-4 - Kühlen'!$E$22)","v":301.33854820253009},421.1311862025301,null,{"$f":"((N45*3.6)+('HFVsf-_-4 - Kühlen'!$E$23*4.19*'HFVsf-_-4 - Kühlen'!$E$22))/('HFVsf-_-4 - Kühlen'!$E$23*4.19)","v":18.157555237726946},{"$f":"Q45-'HFVsf-_-4 - Kühlen'!$E$22","v":2.157555237726946},null,64.1746275,0,"-","Reihe 1 - offen / Reihe 3+4 - 1/3 offen",null,null,null,null,{"$f":"G45/$AL$82*$AM$82","v":32.08731375},{"$f":"H45+(10*LOG(($AM$77+$AM$78+$AM$79)/($AL$77+$AL$78+$AL$79)))","v":28.244326389110046},26.84304997644988,{"$f":"(AB45*('HFVsf-_-4 - Kühlen'!$E$19-'HFVsf-_-4 - Kühlen'!$E$11)/3)*-1","v":74.870398750000007},{"$f":"AE45/('HFVsf-_-4 - Kühlen'!$E$11-'HFVsf-_-4 - Kühlen'!$E$19)","v":10.695771250000002},null,19.841930309298448,{"$f":"AH45*('HFVsf-_-4 - Kühlen'!$E$11-'HFVsf-_-4 - Kühlen'!$E$22)","v":198.41930309298448},273.28970184298447,null,{"$f":"((AI45*3.6)+('HFVsf-_-4 - Kühlen'!$E$23*4.19*'HFVsf-_-4 - Kühlen'!$E$22))/('HFVsf-_-4 - Kühlen'!$E$23*4.19)","v":17.420663267968862},{"$f":"AL45-'HFVsf-_-4 - Kühlen'!$E$22","v":1.4206632679688624},null,50.932244047619044,0,"-","Reihe 1 - offen / Reihe 3+4 - 1/3 offen",null,null,null,null,{"$f":"G45/$AL$82*$AN$82","v":63.372444656250003},{"$f":"H45+(10*LOG(($AN$77+$AN$78+$AN$79)/($AL$77+$AL$78+$AL$79)))","v":31.199997388734836},29.798720976074669,{"$f":"(AW45*('HFVsf-_-4 - Kühlen'!$E$19-'HFVsf-_-4 - Kühlen'!$E$11)/3)*-1","v":147.86903753125},{"$f":"AZ45/('HFVsf-_-4 - Kühlen'!$E$11-'HFVsf-_-4 - Kühlen'!$E$19)","v":21.124148218750001},null,37.16625967912185,{"$f":"BC45*('HFVsf-_-4 - Kühlen'!$E$11-'HFVsf-_-4 - Kühlen'!$E$22)","v":371.6625967912185},519.53163432246856,null,{"$f":"((BD45*3.6)+('HFVsf-_-4 - Kühlen'!$E$23*4.19*'HFVsf-_-4 - Kühlen'!$E$22))/('HFVsf-_-4 - Kühlen'!$E$23*4.19)","v":18.661068712108964},{"$f":"BG45-'HFVsf-_-4 - Kühlen'!$E$22","v":2.661068712108964},null,63.372444656250003,0]
["V3","Reihe 1 - offen / Reihe 3+4 - halb offen",null,null,null,null,{"$f":" 0.00001121*'HFVsf-_-4 - Kühlen'!E18*'HFVsf-_-4 - Kühlen'!E18*'HFVsf-_-4 - Kühlen'!E18 - 0.00515743*'HFVsf-_-4 - Kühlen'!E18*'HFVsf-_-4 - Kühlen'!E18 + 0.98935916*'HFVsf-_-4 - Kühlen'!E18","v":58.571615999999999},{"$f":" -0.00016693*G46*G46*G46 + 0.03676497*G46*G46 - 2.36419998*G46 + 75.33789138+1.5","v":30.947496353604194},{"$f":" -0.00014494*G46*G46*G46 + 0.03027476*G46*G46 - 1.70837942*G46 + 56.70564023","v":31.380800793302782},{"$f":"(G46*('HFVsf-_-4 - Kühlen'!$E$19-'HFVsf-_-4 - Kühlen'!$E$11)/3)*-1","v":136.66710399999999},{"$f":"J46/('HFVsf-_-4 - Kühlen'!$E$11-'HFVsf-_-4 - Kühlen'!$E$19)","v":19.523872000000001},{"$f":"L44","v":30.260429779999999},30.133854820253006,{"$f":"M46*('HFVsf-_-4 - Kühlen'!$E$11-'HFVsf-_-4 - Kühlen'!$E$22)","v":301.33854820253009},438.00565220253009,null,{"$f":"((N46*3.6)+('HFVsf-_-4 - Kühlen'!$E$23*4.19*'HFVsf-_-4 - Kühlen'!$E$22))/('HFVsf-_-4 - Kühlen'!$E$23*4.19)","v":18.157555237726946},{"$f":"Q46-'HFVsf-_-4 - Kühlen'!$E$22","v":2.157555237726946},null,73.214519999999993,0,"V3","Reihe 1 - offen / Reihe 3+4 - halb offen",null,null,null,null,{"$f":"G46/$AL$82*$AM$82","v":36.607259999999997},28.906296527044947,29.339600966743536,{"$f":"(AB46*('HFVsf-_-4 - Kühlen'!$E$19-'HFVsf-_-4 - Kühlen'!$E$11)/3)*-1","v":85.416939999999997},{"$f":"AE46/('HFVsf-_-4 - Kühlen'!$E$11-'HFVsf-_-4 - Kühlen'!$E$19)","v":12.20242},null,19.841930309298448,{"$f":"AH46*('HFVsf-_-4 - Kühlen'!$E$11-'HFVsf-_-4 - Kühlen'!$E$22)","v":198.41930309298448},283.83624309298449,null,{"$f":"((AI46*3.6)+('HFVsf-_-4 - Kühlen'!$E$23*4.19*'HFVsf-_-4 - Kühlen'!$E$22))/('HFVsf-_-4 - Kühlen'!$E$23*4.19)","v":17.420663267968862},{"$f":"AL46-'HFVsf-_-4 - Kühlen'!$E$22","v":1.4206632679688624},null,58.106761904761896,0,"V3","Reihe 1 - offen / Reihe 3+4 - halb offen",null,null,null,null,{"$f":"G46/$AL$82*$AN$82","v":72.299338500000005},31.861967526669737,32.295271966368325,{"$f":"(AW46*('HFVsf-_-4 - Kühlen'!$E$19-'HFVsf-_-4 - Kühlen'!$E$11)/3)*-1","v":168.69845650000002},{"$f":"AZ46/('HFVsf-_-4 - Kühlen'!$E$11-'HFVsf-_-4 - Kühlen'!$E$19)","v":24.099779500000004},null,37.16625967912185,{"$f":"BC46*('HFVsf-_-4 - Kühlen'!$E$11-'HFVsf-_-4 - Kühlen'!$E$22)","v":371.6625967912185},540.36105329121847,null,{"$f":"((BD46*3.6)+('HFVsf-_-4 - Kühlen'!$E$23*4.19*'HFVsf-_-4 - Kühlen'!$E$22))/('HFVsf-_-4 - Kühlen'!$E$23*4.19)","v":18.661068712108964},{"$f":"BG46-'HFVsf-_-4 - Kühlen'!$E$22","v":2.661068712108964},null,72.299338500000005,0]
["V4","Reihe 1 - offen / Reihe 3+4 - offen",null,null,null,null,{"$f":" 0.00001114*'HFVsf-_-4 - Kühlen'!E18*'HFVsf-_-4 - Kühlen'!E18*'HFVsf-_-4 - Kühlen'!E18 - 0.00569142*'HFVsf-_-4 - Kühlen'!E18*'HFVsf-_-4 - Kühlen'!E18 + 1.29588189*'HFVsf-_-4 - Kühlen'!E18","v":83.813988999999992},{"$f":" 0.00002138*G47*G47*G47 - 0.00552666*G47*G47 + 0.65145656*G47 + 3.53424824+1.5","v":33.399838754680843},{"$f":" 0.00001549*G47*G47*G47 - 0.00475234*G47*G47 + 0.74577555*G47 - 2.66924058","v":35.573145938149942},{"$f":"(G47*('HFVsf-_-4 - Kühlen'!$E$19-'HFVsf-_-4 - Kühlen'!$E$11)/3)*-1","v":195.56597433333332},{"$f":"J47/('HFVsf-_-4 - Kühlen'!$E$11-'HFVsf-_-4 - Kühlen'!$E$19)","v":27.937996333333331},{"$f":"L46","v":30.260429779999999},30.133854820253006,{"$f":"M47*('HFVsf-_-4 - Kühlen'!$E$11-'HFVsf-_-4 - Kühlen'!$E$22)","v":301.33854820253009},496.90452253586341,null,{"$f":"((N47*3.6)+('HFVsf-_-4 - Kühlen'!$E$23*4.19*'HFVsf-_-4 - Kühlen'!$E$22))/('HFVsf-_-4 - Kühlen'!$E$23*4.19)","v":18.157555237726946},{"$f":"Q47-'HFVsf-_-4 - Kühlen'!$E$22","v":2.157555237726946},null,104.76748624999999,"! ? !","V4","Reihe 1 - offen / Reihe 3+4 - offen",null,null,null,null,{"$f":"G47/$AL$82*$AM$82","v":52.383743124999995},31.358638928121596,33.531946111590692,{"$f":"(AB47*('HFVsf-_-4 - Kühlen'!$E$19-'HFVsf-_-4 - Kühlen'!$E$11)/3)*-1","v":122.22873395833331},{"$f":"AE47/('HFVsf-_-4 - Kühlen'!$E$11-'HFVsf-_-4 - Kühlen'!$E$19)","v":17.461247708333328},null,19.841930309298448,{"$f":"AH47*('HFVsf-_-4 - Kühlen'!$E$11-'HFVsf-_-4 - Kühlen'!$E$22)","v":198.41930309298448},320.64803705131777,null,{"$f":"((AI47*3.6)+('HFVsf-_-4 - Kühlen'!$E$23*4.19*'HFVsf-_-4 - Kühlen'!$E$22))/('HFVsf-_-4 - Kühlen'!$E$23*4.19)","v":17.420663267968862},{"$f":"AL47-'HFVsf-_-4 - Kühlen'!$E$22","v":1.4206632679688624},null,83.148798611111104,"! ? !","V4","Reihe 1 - offen / Reihe 3+4 - offen",null,null,null,null,{"$f":"G47/$AL$82*$AN$82","v":103.45789267187499},34.314309927746386,36.487617111215485,{"$f":"(AW47*('HFVsf-_-4 - Kühlen'!$E$19-'HFVsf-_-4 - Kühlen'!$E$11)/3)*-1","v":241.40174956770829},{"$f":"AZ47/('HFVsf-_-4 - Kühlen'!$E$11-'HFVsf-_-4 - Kühlen'!$E$19)","v":34.485964223958327},null,37.16625967912185,{"$f":"BC47*('HFVsf-_-4 - Kühlen'!$E$11-'HFVsf-_-4 - Kühlen'!$E$22)","v":371.6625967912185},613.06434635892674,null,{"$f":"((BD47*3.6)+('HFVsf-_-4 - Kühlen'!$E$23*4.19*'HFVsf-_-4 - Kühlen'!$E$22))/('HFVsf-_-4 - Kühlen'!$E$23*4.19)","v":18.661068712108964},{"$f":"BG47-'HFVsf-_-4 - Kühlen'!$E$22","v":2.661068712108964},null,103.45789267187499,"! ? !"]
["V5","Reihe 1 - offen / Reihe 3+4 - offen / Reihe 2 - halb offen",null,null,null,null,{"$f":" 0.00001643*'HFVsf-_-4 - Kühlen'!E18*'HFVsf-_-4 - Kühlen'!E18*'HFVsf-_-4 - Kühlen'!E18 - 0.00778044*'HFVsf-_-4 - Kühlen'!E18*'HFVsf-_-4 - Kühlen'!E18 + 1.57165254*'HFVsf-_-4 - Kühlen'!E18","v":95.790853999999996},{"$f":" 0.00001677*G48*G48*G48 - 0.00520804*G48*G48 + 0.72331681*G48 - 3.76279164+1","v":33.476214904634517},{"$f":" 0.000005*G48*G48*G48 - 0.00228525*G48*G48 + 0.58129671*G48 - 4.48854499","v":34.61999649866879},{"$f":"(G48*('HFVsf-_-4 - Kühlen'!$E$19-'HFVsf-_-4 - Kühlen'!$E$11)/3)*-1","v":223.51199266666666},{"$f":"J48/('HFVsf-_-4 - Kühlen'!$E$11-'HFVsf-_-4 - Kühlen'!$E$19)","v":31.930284666666665},{"$f":" 0.00000724*G48*G48*G48 - 0.00507231*G48*G48 + 1.16582334*G48 - 36.10721949","v":35.388761579637112},{"$f":" (-0.00000006*A6*A6*A6*A6 + 0.0000435*A6*A6*A6 - 0.01202881*A6*A6 + 1.5521255*A6 + 27.25688021)*(L48/100)","v":35.27598828742768},{"$f":"M48*('HFVsf-_-4 - Kühlen'!$E$11-'HFVsf-_-4 - Kühlen'!$E$22)","v":352.7598828742768},576.27187554094348,null,{"$f":"((N48*3.6)+('HFVsf-_-4 - Kühlen'!$E$23*4.19*'HFVsf-_-4 - Kühlen'!$E$22))/('HFVsf-_-4 - Kühlen'!$E$23*4.19)","v":18.525727085018687},{"$f":"Q48-'HFVsf-_-4 - Kühlen'!$E$22","v":2.525727085018687},null,119.73856749999999,"! ? !","V5","Reihe 1 - offen / Reihe 3+4 - offen / Reihe 2 - halb offen",null,null,null,null,{"$f":"G48/$AL$84*$AM$84","v":58.409057317073163},{"$f":"H48+(10*LOG(($AM$84)/($AL$84)))","v":31.327776424157538},{"$f":"I48+(10*LOG(($AM$84)/($AL$84)))","v":32.471558018191814},{"$f":"(AB48*('HFVsf-_-4 - Kühlen'!$E$19-'HFVsf-_-4 - Kühlen'!$E$11)/3)*-1","v":136.28780040650403},{"$f":"AE48/('HFVsf-_-4 - Kühlen'!$E$11-'HFVsf-_-4 - Kühlen'!$E$19)","v":19.469685772357717},null,23.227818192060024,{"$f":"AH48*('HFVsf-_-4 - Kühlen'!$E$11-'HFVsf-_-4 - Kühlen'!$E$22)","v":232.27818192060025},368.56598232710428,null,{"$f":"((AI48*3.6)+('HFVsf-_-4 - Kühlen'!$E$23*4.19*'HFVsf-_-4 - Kühlen'!$E$22))/('HFVsf-_-4 - Kühlen'!$E$23*4.19)","v":17.663089608023391},{"$f":"AL48-'HFVsf-_-4 - Kühlen'!$E$22","v":1.663089608023391},null,92.71278939217963,"! ? !","V5","Reihe 1 - offen / Reihe 3+4 - offen / Reihe 2 - halb offen",null,null,null,null,{"$f":"G48/$AL$84*$AN$84","v":119.15447692682926},{"$f":"H48+(10*LOG(($AN$84)/($AL$84)))","v":34.424078098416523},{"$f":"I48+(10*LOG(($AN$84)/($AL$84)))","v":35.567859692450796},{"$f":"(AW48*('HFVsf-_-4 - Kühlen'!$E$19-'HFVsf-_-4 - Kühlen'!$E$11)/3)*-1","v":278.02711282926828},{"$f":"AZ48/('HFVsf-_-4 - Kühlen'!$E$11-'HFVsf-_-4 - Kühlen'!$E$19)","v":39.718158975609754},null,43.50842429382854,{"$f":"BC48*('HFVsf-_-4 - Kühlen'!$E$11-'HFVsf-_-4 - Kühlen'!$E$22)","v":435.0842429382854},713.11135576755373,null,{"$f":"((BD48*3.6)+('HFVsf-_-4 - Kühlen'!$E$23*4.19*'HFVsf-_-4 - Kühlen'!$E$22))/('HFVsf-_-4 - Kühlen'!$E$23*4.19)","v":19.115161643949538},{"$f":"BG48-'HFVsf-_-4 - Kühlen'!$E$22","v":3.1151616439495378},null,119.15447692682926,"! ? !"]
["V6","alles offen - Boost",null,null,null,null,{"$f":" 0.00001944*'HFVsf-_-4 - Kühlen'!E18*'HFVsf-_-4 - Kühlen'!E18*'HFVsf-_-4 - Kühlen'!E18 - 0.00899448*'HFVsf-_-4 - Kühlen'!E18*'HFVsf-_-4 - Kühlen'!E18 + 1.7594462*'HFVsf-_-4 - Kühlen'!E18","v":105.43982},{"$f":" -0.000015*G49*G49*G49 + 0.00599418*G49*G49 - 0.59801586*G49 + 46.24012038+1","v":33.242569435009337},{"$f":" -0.00003432*G49*G49*G49 + 0.01224967*G49*G49 - 1.18836976*G49 + 63.60257406","v":34.256429474184038},{"$f":"(G49*('HFVsf-_-4 - Kühlen'!$E$19-'HFVsf-_-4 - Kühlen'!$E$11)/3)*-1","v":246.02624666666665},{"$f":"J49/('HFVsf-_-4 - Kühlen'!$E$11-'HFVsf-_-4 - Kühlen'!$E$19)","v":35.146606666666663},{"$f":" 0.00000418*'HFVsf-_-4 - Kühlen'!E18*'HFVsf-_-4 - Kühlen'!E18*'HFVsf-_-4 - Kühlen'!E18 - 0.00252654*'HFVsf-_-4 - Kühlen'!E18*'HFVsf-_-4 - Kühlen'!E18 + 0.56349124*'HFVsf-_-4 - Kühlen'!E18 + 3.31123587","v":38.574959869999994},{"$f":" (-0.00000006*A6*A6*A6*A6 + 0.0000435*A6*A6*A6 - 0.01202881*A6*A6 + 1.5521255*A6 + 27.25688021)*(L49/100)","v":38.452033126389679},{"$f":"M49*('HFVsf-_-4 - Kühlen'!$E$11-'HFVsf-_-4 - Kühlen'!$E$22)","v":384.52033126389676},630.54657793056344,null,{"$f":"((N49*3.6)+('HFVsf-_-4 - Kühlen'!$E$23*4.19*'HFVsf-_-4 - Kühlen'!$E$22))/('HFVsf-_-4 - Kühlen'!$E$23*4.19)","v":18.753128863464653},{"$f":"Q49-'HFVsf-_-4 - Kühlen'!$E$22","v":2.7531288634646529},null,131.79977499999998,"! ? !","V6","alles offen - Boost",null,null,null,null,{"$f":"G49/$AL$84*$AM$84","v":64.2925731707317},{"$f":"H49+(10*LOG(($AM$84)/($AL$84)))","v":31.094130954532357},{"$f":"I49+(10*LOG(($AM$84)/($AL$84)))","v":32.107990993707062},{"$f":"(AB49*('HFVsf-_-4 - Kühlen'!$E$19-'HFVsf-_-4 - Kühlen'!$E$11)/3)*-1","v":150.01600406504062},{"$f":"AE49/('HFVsf-_-4 - Kühlen'!$E$11-'HFVsf-_-4 - Kühlen'!$E$19)","v":21.43085772357723},null,25.31911586140221,{"$f":"AH49*('HFVsf-_-4 - Kühlen'!$E$11-'HFVsf-_-4 - Kühlen'!$E$22)","v":253.1911586140221},403.20716267906272,null,{"$f":"((AI49*3.6)+('HFVsf-_-4 - Kühlen'!$E$23*4.19*'HFVsf-_-4 - Kühlen'!$E$22))/('HFVsf-_-4 - Kühlen'!$E$23*4.19)","v":17.812824524682735},{"$f":"AL49-'HFVsf-_-4 - Kühlen'!$E$22","v":1.8128245246827355},null,102.05170344560587,"! ? !","V6","alles offen - Boost",null,null,null,null,{"$f":"G49/$AL$84*$AN$84","v":131.15684926829269},{"$f":"H49+(10*LOG(($AN$84)/($AL$84)))","v":34.190432628791342},{"$f":"I49+(10*LOG(($AN$84)/($AL$84)))","v":35.204292667966044},{"$f":"(AW49*('HFVsf-_-4 - Kühlen'!$E$19-'HFVsf-_-4 - Kühlen'!$E$11)/3)*-1","v":306.03264829268295},{"$f":"AZ49/('HFVsf-_-4 - Kühlen'!$E$11-'HFVsf-_-4 - Kühlen'!$E$19)","v":43.718949756097565},null,47.425669795325426,{"$f":"BC49*('HFVsf-_-4 - Kühlen'!$E$11-'HFVsf-_-4 - Kühlen'!$E$22)","v":474.25669795325427},780.28934624593717,null,{"$f":"((BD49*3.6)+('HFVsf-_-4 - Kühlen'!$E$23*4.19*'HFVsf-_-4 - Kühlen'!$E$22))/('HFVsf-_-4 - Kühlen'!$E$23*4.19)","v":19.395632682242869},{"$f":"BG49-'HFVsf-_-4 - Kühlen'!$E$22","v":3.3956326822428693},null,131.15684926829269,"! ? !"]
[]
[null,"BG800 - Heizen",null,null,null,null,null,null,null,null,null,null,null,null,null,null,null,null,null,null,null,null,"BG630 - Heizen",null,null,null,null,null,null,null,null,null,null,null,null,null,null,null,null,null,null,null,null,"BG1000 - Heizen"]
[null,null,null,null,null,"Dp","VP","LwA","LwA","Qp","QP/DtP","Qh/Dt_Nenn","Qh/Dt","Qh","Qh Gesamt",null,"TRL","DT_Wasser",null,null,null,null,null,null,null,null,"Dp","VP","LwA","LwA","Qp","QP/DtP",null,"Qh/Dt","Qh","Qh Gesamt",null,"TRL","DT_Wasser",null,null,null,null,null,null,null,null,"Dp","VP","LwA","LwA","Qp","QP/DtP",null,"Qh/Dt","Qh","Qh Gesamt",null,"TRL","DT_Wasser"]
[null,"Dp W.",{"$f":" 0.00032265*'HFVsf-_-4 - Heizen'!E19*'HFVsf-_-4 - Heizen'!E19 + 0.00130927*'HFVsf-_-4 - Heizen'!E19","v":3.3574269999999999},"kPa",null,"Pa","m³/h","MQ","MQQ","W","W/K","W/K","W/K","W","W",null,"°C","K",null,null,null,null,"Dp W.",{"$f":" -0.00000004*'HFVsf-_-4 - Heizen'!$E$19*'HFVsf-_-4 - Heizen'!$E$19*'HFVsf-_-4 - Heizen'!$E$19 + 0.00029456*'HFVsf-_-4 - Heizen'!$E$19*'HFVsf-_-4 - Heizen'!$E$19 - 0.00106109*'HFVsf-_-4 - Heizen'!$E$19","v":2.7994910000000002},"kPa",null,"Pa","m³/h","MQ","MQQ","W","W/K",null,"W/K","W","W",null,"°C","K",null,null,null,null,"Dp W.",{"$f":" -0.00000001*'HFVsf-_-4 - Heizen'!$E$19*'HFVsf-_-4 - Heizen'!$E$19*'HFVsf-_-4 - Heizen'!$E$19*'HFVsf-_-4 - Heizen'!$E$19 + 0.00000446*'HFVsf-_-4 - Heizen'!$E$19*'HFVsf-_-4 - Heizen'!$E$19*'HFVsf-_-4 - Heizen'!$E$19 - 0.00008954*'HFVsf-_-4 - Heizen'!$E$19*'HFVsf-_-4 - Heizen'!$E$19 + 0.01623801*'HFVsf-_-4 - Heizen'!$E$19","v":4.1884009999999989},"kPa",null,"Pa","m³/h","MQ","MQQ","W","W/K",null,"W/K","W","W",null,"°C","K"]
[null,"Düsenreihen:",null,null,null,{"$f":"'HFVsf-_-4 - Heizen'!$E$14","v":100},null,null,null,null,null,"100L/h",null,null,null,null,null,null,null,"! ? !",null,null,"Düsenreihen:",null,null,null,{"$f":"'HFVsf-_-4 - Heizen'!$E$14","v":100},null,null,null,null,null,null,null,null,null,null,null,null,null,"! ? !",null,null,"Düsenreihen:",null,null,null,{"$f":"'HFVsf-_-4 - Heizen'!$E$14","v":100},null,null,null,null,null,null,null,null,null,null,null,null,null,"! ? !"]
["V0","geschlossen",null,null,null,null,{"$f":" 0.0000012*'HFVsf-_-4 - Heizen'!E14*'HFVsf-_-4 - Heizen'!E14*'HFVsf-_-4 - Heizen'!E14 - 0.00056156*'HFVsf-_-4 - Heizen'!E14*'HFVsf-_-4 - Heizen'!E14 + 0.11947194*'HFVsf-_-4 - Heizen'!E14","v":7.5315940000000001},{"$f":" -0.09683515*G55*G55*G55 + 2.82937202*G55*G55 - 25.31985844*G55 + 100.69909147","v":29.125283427196237},{"$f":"  -0.09683515*G55*G55*G55 + 2.82937202*G55*G55 - 25.31985844*G55 + 100.69909147","v":29.125283427196237},{"$f":"(G55*('HFVsf-_-4 - Heizen'!$E$15-'HFVsf-_-4 - Heizen'!$E$11)/3)","v":-10.042125333333333},{"$f":"J55/('HFVsf-_-4 - Heizen'!$E$11-'HFVsf-_-4 - Heizen'!$E$15)","v":-2.5105313333333332},{"$f":" (-0.00044271*K8*K8*K8 + 0.08535026*K8*K8 + 4.57471629*K8)/('HFVsf-_-4 - Heizen'!E18-'HFVsf-_-4 - Heizen'!E11)","v":6.9091636799999989},{"$f":" (0.00002283*$K$6*$K$6*$K$6 - 0.00884453*$K$6*$K$6 + 1.25881688*$K$6 + 39.75040963)*(L55/100)","v":6.9103242557510614},{"$f":"M55*('HFVsf-_-4 - Heizen'!$E$18-'HFVsf-_-4 - Heizen'!$E$11)","v":228.04070043978501},{"$f":"N55+J55","v":217.99857510645168},null,{"$f":"(((N55*3.6)-('HFVsf-_-4 - Heizen'!$E$19*4.19*'HFVsf-_-4 - Heizen'!$E$18))/('HFVsf-_-4 - Heizen'!$E$19*4.19))*-1","v":53.040700425815686},{"$f":"'HFVsf-_-4 - Heizen'!$E$18-Q55","v":1.959299574184314},null,{"$f":"G55/0.8","v":9.4144924999999997},{"$f":"IF(T55>75,$T$41,$U$41)","v":0},"V0","geschlossen",null,null,null,null,{"$f":"G55/$AL$84*$AM$84","v":4.5924353658536585},{"$f":"H55+(10*LOG($AM$84/$AL$84))","v":26.976844946719257},{"$f":"I55+(10*LOG($AM$84/$AL$84))","v":26.976844946719257},{"$f":"(AB55*('HFVsf-_-4 - Heizen'!$E$15-'HFVsf-_-4 - Heizen'!$E$11)/3)","v":-6.123247154471545},{"$f":"AE55/('HFVsf-_-4 - Heizen'!$E$11-'HFVsf-_-4 - Heizen'!$E$15)","v":-1.5308117886178862},null,{"$f":" (M55/$AL$86*$AM$86)*0.9","v":4.5501703354962943},{"$f":"AH55*('HFVsf-_-4 - Heizen'!$E$18-'HFVsf-_-4 - Heizen'!$E$11)","v":150.15562107137771},{"$f":"AI55+AE55","v":144.03237391690615},null,{"$f":"(((AI55*3.6)-('HFVsf-_-4 - Heizen'!$E$19*4.19*'HFVsf-_-4 - Heizen'!$E$18))/('HFVsf-_-4 - Heizen'!$E$19*4.19))*-1","v":53.709880105353321},{"$f":"'HFVsf-_-4 - Heizen'!$E$18-AL55","v":1.2901198946466792},null,{"$f":"AB55/0.63","v":7.2895799457994581},{"$f":"IF(AO55>75,$T$41,$U$41)","v":0},"V0","geschlossen",null,null,null,null,{"$f":"G55/$AL$84*$AN$84","v":9.3685681463414632},{"$f":"H55+(10*LOG($AN$84/$AL$84))","v":30.073146620978246},{"$f":"I55+(10*LOG($AN$84/$AL$84))","v":30.073146620978246},{"$f":"(AW55*('HFVsf-_-4 - Heizen'!$E$15-'HFVsf-_-4 - Heizen'!$E$11)/3)","v":-12.491424195121951},{"$f":"AZ55/('HFVsf-_-4 - Heizen'!$E$11-'HFVsf-_-4 - Heizen'!$E$15)","v":-3.1228560487804877},null,{"$f":" (M55/$AL$86*$AN$86)","v":8.5230020283884151},{"$f":"BC55*('HFVsf-_-4 - Heizen'!$E$18-'HFVsf-_-4 - Heizen'!$E$11)","v":281.2590669368177},{"$f":"BD55+AZ55","v":268.76764274169574},null,{"$f":"(((BD55*3.6)-('HFVsf-_-4 - Heizen'!$E$19*4.19*'HFVsf-_-4 - Heizen'!$E$18))/('HFVsf-_-4 - Heizen'!$E$19*4.19))*-1","v":52.58345431748797},{"$f":"'HFVsf-_-4 - Heizen'!$E$18-BG55","v":2.4165456825120302},null,{"$f":"AW55/1","v":9.3685681463414632},{"$f":"IF(BJ55>75,$T$41,$U$41)","v":0}]
["V1","Reihe 1 - halb offen",null,null,null,null,{"$f":" 0.0000037*'HFVsf-_-4 - Heizen'!E14*'HFVsf-_-4 - Heizen'!E14*'HFVsf-_-4 - Heizen'!E14 - 0.00170264*'HFVsf-_-4 - Heizen'!E14*'HFVsf-_-4 - Heizen'!E14 + 0.33699235*'HFVsf-_-4 - Heizen'!E14","v":20.372835000000002},{"$f":" 0.00318987*G56*G56*G56 - 0.20009878*G56*G56 + 4.44969236*G56 - 6.23321246","v":28.341039915907007},{"$f":" 0.00318987*G56*G56*G56 - 0.20009878*G56*G56 + 4.44969236*G56 - 6.23321246","v":28.341039915907007},{"$f":"(G56*('HFVsf-_-4 - Heizen'!$E$15-'HFVsf-_-4 - Heizen'!$E$11)/3)","v":-27.163780000000003},{"$f":"J56/('HFVsf-_-4 - Heizen'!$E$11-'HFVsf-_-4 - Heizen'!$E$15)","v":-6.7909450000000007},{"$f":" -0.00010264*'HFVsf-_-4 - Heizen'!E14*'HFVsf-_-4 - Heizen'!E14 + 0.08917651*'HFVsf-_-4 - Heizen'!E14 + 11.04922042","v":18.940471419999998},18.94365297030939,{"$f":"M56*('HFVsf-_-4 - Heizen'!$E$18-'HFVsf-_-4 - Heizen'!$E$11)","v":625.14054802020985},{"$f":"N56+J56","v":597.97676802020987},null,{"$f":"(((N56*3.6)-('HFVsf-_-4 - Heizen'!$E$19*4.19*'HFVsf-_-4 - Heizen'!$E$18))/('HFVsf-_-4 - Heizen'!$E$19*4.19))*-1","v":49.628864026556677},{"$f":"'HFVsf-_-4 - Heizen'!$E$18-Q56","v":5.3711359734433231},null,{"$f":"G56/0.8","v":25.466043750000001},{"$f":"IF(T56>75,$T$41,$U$41)","v":0},"V1","Reihe 1 - halb offen",null,null,null,null,{"$f":"G56/$AL$84*$AM$84","v":12.422460365853659},{"$f":"H56+(10*LOG($AM$77/$AL$77))","v":26.258280491636182},{"$f":"I56+(10*LOG($AM$77/$AL$77))","v":26.258280491636182},{"$f":"(AB56*('HFVsf-_-4 - Heizen'!$E$15-'HFVsf-_-4 - Heizen'!$E$11)/3)","v":-16.563280487804878},{"$f":"AE56/('HFVsf-_-4 - Heizen'!$E$11-'HFVsf-_-4 - Heizen'!$E$15)","v":-4.1408201219512195},null,{"$f":" (M56/$AL$86*$AM$86)*0.9","v":12.473632871815155},{"$f":"AH56*('HFVsf-_-4 - Heizen'!$E$18-'HFVsf-_-4 - Heizen'!$E$11)","v":411.62988476990012},{"$f":"AI56+AE56","v":395.06660428209523},null,{"$f":"(((AI56*3.6)-('HFVsf-_-4 - Heizen'!$E$19*4.19*'HFVsf-_-4 - Heizen'!$E$18))/('HFVsf-_-4 - Heizen'!$E$19*4.19))*-1","v":51.463323185747875},{"$f":"'HFVsf-_-4 - Heizen'!$E$18-AL56","v":3.5366768142521252},null,{"$f":"AB56/0.63","v":19.71819105691057},{"$f":"IF(AO56>75,$T$41,$U$41)","v":0},"V1","Reihe 1 - halb offen",null,null,null,null,{"$f":"G56/$AL$84*$AN$84","v":25.341819146341468},{"$f":"H56+(10*LOG($AN$77/$AL$77))","v":29.268580448275994},{"$f":"I56+(10*LOG($AN$77/$AL$77))","v":29.268580448275994},{"$f":"(AW56*('HFVsf-_-4 - Heizen'!$E$15-'HFVsf-_-4 - Heizen'!$E$11)/3)","v":-33.78909219512196},{"$f":"AZ56/('HFVsf-_-4 - Heizen'!$E$11-'HFVsf-_-4 - Heizen'!$E$15)","v":-8.4472730487804899},null,23.364575483800493,{"$f":"BC56*('HFVsf-_-4 - Heizen'!$E$18-'HFVsf-_-4 - Heizen'!$E$11)","v":771.03099096541632},737.24189877029437,null,{"$f":"(((BD56*3.6)-('HFVsf-_-4 - Heizen'!$E$19*4.19*'HFVsf-_-4 - Heizen'!$E$18))/('HFVsf-_-4 - Heizen'!$E$19*4.19))*-1","v":48.375390053757755},{"$f":"'HFVsf-_-4 - Heizen'!$E$18-BG56","v":6.624609946242245},null,{"$f":"AW56/1","v":25.341819146341468},{"$f":"IF(BJ56>75,$T$41,$U$41)","v":0}]
["V2","Reihe 1 - offen",null,null,null,null,{"$f":" 0.00000518*'HFVsf-_-4 - Heizen'!E14*'HFVsf-_-4 - Heizen'!E14*'HFVsf-_-4 - Heizen'!E14- 0.00258029*'HFVsf-_-4 - Heizen'!E14*'HFVsf-_-4 - Heizen'!E14 + 0.53187237*'HFVsf-_-4 - Heizen'!E14","v":32.564336999999995},{"$f":" 0.00079259*G57*G57*G57 - 0.06598958*G57*G57 + 1.90619065*G57 + 8.87776506","v":28.343902905835371},{"$f":" 0.00079259*G57*G57*G57 - 0.06598958*G57*G57 + 1.90619065*G57 + 8.87776506","v":28.343902905835371},{"$f":"(G57*('HFVsf-_-4 - Heizen'!$E$15-'HFVsf-_-4 - Heizen'!$E$11)/3)","v":-43.419115999999995},{"$f":"J57/('HFVsf-_-4 - Heizen'!$E$11-'HFVsf-_-4 - Heizen'!$E$15)","v":-10.854778999999999},{"$f":" -0.00024663*'HFVsf-_-4 - Heizen'!E14*'HFVsf-_-4 - Heizen'!E14 + 0.14055954*'HFVsf-_-4 - Heizen'!E14 + 13.32188883","v":24.911542830000002},24.915727378791882,{"$f":"M57*('HFVsf-_-4 - Heizen'!$E$18-'HFVsf-_-4 - Heizen'!$E$11)","v":822.21900350013209},778.79988750013206,null,{"$f":"(((N57*3.6)-('HFVsf-_-4 - Heizen'!$E$19*4.19*'HFVsf-_-4 - Heizen'!$E$18))/('HFVsf-_-4 - Heizen'!$E$19*4.19))*-1","v":47.93558851408001},{"$f":"'HFVsf-_-4 - Heizen'!$E$18-Q57","v":7.0644114859199902},null,40.705421249999993,0,"V2","Reihe 1 - offen",null,null,null,null,{"$f":"G57/$AL$77*$AM$77","v":20.158875285714281},{"$f":"H57+(10*LOG($AM$77/$AL$77))","v":26.261143481564545},{"$f":"I57+(10*LOG($AM$77/$AL$77))","v":26.261143481564545},{"$f":"(AB57*('HFVsf-_-4 - Heizen'!$E$15-'HFVsf-_-4 - Heizen'!$E$11)/3)","v":-26.878500380952374},{"$f":"AE57/('HFVsf-_-4 - Heizen'!$E$11-'HFVsf-_-4 - Heizen'!$E$15)","v":-6.7196250952380936},null,16.406003453736595,{"$f":"AH57*('HFVsf-_-4 - Heizen'!$E$18-'HFVsf-_-4 - Heizen'!$E$11)","v":541.39811397330766},514.51961359235531,null,{"$f":"(((AI57*3.6)-('HFVsf-_-4 - Heizen'!$E$19*4.19*'HFVsf-_-4 - Heizen'!$E$18))/('HFVsf-_-4 - Heizen'!$E$19*4.19))*-1","v":50.348369426482321},{"$f":"'HFVsf-_-4 - Heizen'!$E$18-AL57","v":4.6516305735176786},null,31.998214739229017,0,"V2","Reihe 1 - offen",null,null,null,null,{"$f":"G57/$AL$77*$AN$77","v":40.317750571428562},{"$f":"H57+(10*LOG($AN$77/$AL$77))","v":29.271443438204358},{"$f":"I57+(10*LOG($AN$77/$AL$77))","v":29.271443438204358},{"$f":"(AW57*('HFVsf-_-4 - Heizen'!$E$15-'HFVsf-_-4 - Heizen'!$E$11)/3)","v":-53.757000761904749},{"$f":"AZ57/('HFVsf-_-4 - Heizen'!$E$11-'HFVsf-_-4 - Heizen'!$E$15)","v":-13.439250190476187},null,30.730366206981355,{"$f":"BC57*('HFVsf-_-4 - Heizen'!$E$18-'HFVsf-_-4 - Heizen'!$E$11)","v":1014.1020848303847},960.34508406847999,null,{"$f":"(((BD57*3.6)-('HFVsf-_-4 - Heizen'!$E$19*4.19*'HFVsf-_-4 - Heizen'!$E$18))/('HFVsf-_-4 - Heizen'!$E$19*4.19))*-1","v":46.28695106112319},{"$f":"'HFVsf-_-4 - Heizen'!$E$18-BG57","v":8.7130489388768098},null,40.317750571428562,0]
["-","Reihe 1 - offen / Reihe 3+4 - 1/3 offen",null,null,null,null,{"$f":" 0.00001155*'HFVsf-_-4 - Heizen'!E14*'HFVsf-_-4 - Heizen'!E14*'HFVsf-_-4 - Heizen'!E14 - 0.00512238*'HFVsf-_-4 - Heizen'!E14*'HFVsf-_-4 - Heizen'!E14 + 0.91013502*'HFVsf-_-4 - Heizen'!E14","v":51.339702000000003},{"$f":" 0.01223661*G58*G58 - 1.10949158*G58 + 53.49366493 +1.5","v":30.285526215669293},{"$f":" 0.00940726*G58*G58- 0.71447208*G58 + 40.76970681","v":28.884249803009126},{"$f":"(G58*('HFVsf-_-4 - Heizen'!$E$15-'HFVsf-_-4 - Heizen'!$E$11)/3)","v":-68.452936000000008},{"$f":"J58/('HFVsf-_-4 - Heizen'!$E$11-'HFVsf-_-4 - Heizen'!$E$15)","v":-17.113234000000002},{"$f":"L57","v":24.911542830000002},24.915727378791882,{"$f":"M58*('HFVsf-_-4 - Heizen'!$E$18-'HFVsf-_-4 - Heizen'!$E$11)","v":822.21900350013209},753.76606750013207,null,{"$f":"(((N58*3.6)-('HFVsf-_-4 - Heizen'!$E$19*4.19*'HFVsf-_-4 - Heizen'!$E$18))/('HFVsf-_-4 - Heizen'!$E$19*4.19))*-1","v":47.93558851408001},{"$f":"'HFVsf-_-4 - Heizen'!$E$18-Q58","v":7.0644114859199902},null,64.1746275,0,"-","Reihe 1 - offen / Reihe 3+4 - 1/3 offen",null,null,null,null,{"$f":"G58/$AL$82*$AM$82","v":32.08731375},{"$f":"H58+(10*LOG(($AM$77+$AM$78+$AM$79)/($AL$77+$AL$78+$AL$79)))","v":28.244326389110046},26.84304997644988,{"$f":"(AB58*('HFVsf-_-4 - Heizen'!$E$15-'HFVsf-_-4 - Heizen'!$E$11)/3)","v":-42.783085},{"$f":"AE58/('HFVsf-_-4 - Heizen'!$E$11-'HFVsf-_-4 - Heizen'!$E$15)","v":-10.69577125},null,16.406003453736595,{"$f":"AH58*('HFVsf-_-4 - Heizen'!$E$18-'HFVsf-_-4 - Heizen'!$E$11)","v":541.39811397330766},498.61502897330763,null,{"$f":"(((AI58*3.6)-('HFVsf-_-4 - Heizen'!$E$19*4.19*'HFVsf-_-4 - Heizen'!$E$18))/('HFVsf-_-4 - Heizen'!$E$19*4.19))*-1","v":50.348369426482321},{"$f":"'HFVsf-_-4 - Heizen'!$E$18-AL58","v":4.6516305735176786},null,50.932244047619044,0,"-","Reihe 1 - offen / Reihe 3+4 - 1/3 offen",null,null,null,null,{"$f":"G58/$AL$82*$AN$82","v":63.372444656250003},{"$f":"H58+(10*LOG(($AN$77+$AN$78+$AN$79)/($AL$77+$AL$78+$AL$79)))","v":31.199997388734836},29.798720976074669,{"$f":"(AW58*('HFVsf-_-4 - Heizen'!$E$15-'HFVsf-_-4 - Heizen'!$E$11)/3)","v":-84.496592875000005},{"$f":"AZ58/('HFVsf-_-4 - Heizen'!$E$11-'HFVsf-_-4 - Heizen'!$E$15)","v":-21.124148218750001},null,30.730366206981355,{"$f":"BC58*('HFVsf-_-4 - Heizen'!$E$18-'HFVsf-_-4 - Heizen'!$E$11)","v":1014.1020848303847},929.60549195538465,null,{"$f":"(((BD58*3.6)-('HFVsf-_-4 - Heizen'!$E$19*4.19*'HFVsf-_-4 - Heizen'!$E$18))/('HFVsf-_-4 - Heizen'!$E$19*4.19))*-1","v":46.28695106112319},{"$f":"'HFVsf-_-4 - Heizen'!$E$18-BG58","v":8.7130489388768098},null,63.372444656250003,0]
["V3","Reihe 1 - offen / Reihe 3+4 - halb offen",null,null,null,null,{"$f":" 0.00001121*'HFVsf-_-4 - Heizen'!E14*'HFVsf-_-4 - Heizen'!E14*'HFVsf-_-4 - Heizen'!E14 - 0.00515743*'HFVsf-_-4 - Heizen'!E14*'HFVsf-_-4 - Heizen'!E14 + 0.98935916*'HFVsf-_-4 - Heizen'!E14","v":58.571615999999999},{"$f":" -0.00016693*G59*G59*G59 + 0.03676497*G59*G59 - 2.36419998*G59 + 75.33789138+1.5","v":30.947496353604194},{"$f":" -0.00014494*G59*G59*G59 + 0.03027476*G59*G59 - 1.70837942*G59 + 56.70564023","v":31.380800793302782},{"$f":"(G59*('HFVsf-_-4 - Heizen'!$E$15-'HFVsf-_-4 - Heizen'!$E$11)/3)","v":-78.095488000000003},{"$f":"J59/('HFVsf-_-4 - Heizen'!$E$11-'HFVsf-_-4 - Heizen'!$E$15)","v":-19.523872000000001},{"$f":"L57","v":24.911542830000002},24.915727378791882,{"$f":"M59*('HFVsf-_-4 - Heizen'!$E$18-'HFVsf-_-4 - Heizen'!$E$11)","v":822.21900350013209},744.12351550013204,null,{"$f":"(((N59*3.6)-('HFVsf-_-4 - Heizen'!$E$19*4.19*'HFVsf-_-4 - Heizen'!$E$18))/('HFVsf-_-4 - Heizen'!$E$19*4.19))*-1","v":47.93558851408001},{"$f":"'HFVsf-_-4 - Heizen'!$E$18-Q59","v":7.0644114859199902},null,73.214519999999993,0,"V3","Reihe 1 - offen / Reihe 3+4 - halb offen",null,null,null,null,{"$f":"G59/$AL$82*$AM$82","v":36.607259999999997},28.906296527044947,29.339600966743536,{"$f":"(AB59*('HFVsf-_-4 - Heizen'!$E$15-'HFVsf-_-4 - Heizen'!$E$11)/3)","v":-48.809679999999993},{"$f":"AE59/('HFVsf-_-4 - Heizen'!$E$11-'HFVsf-_-4 - Heizen'!$E$15)","v":-12.202419999999998},null,16.406003453736595,{"$f":"AH59*('HFVsf-_-4 - Heizen'!$E$18-'HFVsf-_-4 - Heizen'!$E$11)","v":541.39811397330766},492.58843397330764,null,{"$f":"(((AI59*3.6)-('HFVsf-_-4 - Heizen'!$E$19*4.19*'HFVsf-_-4 - Heizen'!$E$18))/('HFVsf-_-4 - Heizen'!$E$19*4.19))*-1","v":50.348369426482321},{"$f":"'HFVsf-_-4 - Heizen'!$E$18-AL59","v":4.6516305735176786},null,58.106761904761896,0,"V3","Reihe 1 - offen / Reihe 3+4 - halb offen",null,null,null,null,{"$f":"G59/$AL$82*$AN$82","v":72.299338500000005},31.861967526669737,32.295271966368325,{"$f":"(AW59*('HFVsf-_-4 - Heizen'!$E$15-'HFVsf-_-4 - Heizen'!$E$11)/3)","v":-96.399118000000001},{"$f":"AZ59/('HFVsf-_-4 - Heizen'!$E$11-'HFVsf-_-4 - Heizen'!$E$15)","v":-24.0997795},null,30.730366206981355,{"$f":"BC59*('HFVsf-_-4 - Heizen'!$E$18-'HFVsf-_-4 - Heizen'!$E$11)","v":1014.1020848303847},917.70296683038464,null,{"$f":"(((BD59*3.6)-('HFVsf-_-4 - Heizen'!$E$19*4.19*'HFVsf-_-4 - Heizen'!$E$18))/('HFVsf-_-4 - Heizen'!$E$19*4.19))*-1","v":46.28695106112319},{"$f":"'HFVsf-_-4 - Heizen'!$E$18-BG59","v":8.7130489388768098},null,72.299338500000005,0]
["V4","Reihe 1 - offen / Reihe 3+4 - offen",null,null,null,null,{"$f":" 0.00001114*'HFVsf-_-4 - Heizen'!E14*'HFVsf-_-4 - Heizen'!E14*'HFVsf-_-4 - Heizen'!E14 - 0.00569142*'HFVsf-_-4 - Heizen'!E14*'HFVsf-_-4 - Heizen'!E14 + 1.29588189*'HFVsf-_-4 - Heizen'!E14","v":83.813988999999992},{"$f":" 0.00002138*G60*G60*G60 - 0.00552666*G60*G60 + 0.65145656*G60 + 3.53424824+1.5","v":33.399838754680843},{"$f":" 0.00001549*G60*G60*G60 - 0.00475234*G60*G60 + 0.74577555*G60 - 2.66924058","v":35.573145938149942},{"$f":"(G60*('HFVsf-_-4 - Heizen'!$E$15-'HFVsf-_-4 - Heizen'!$E$11)/3)","v":-111.75198533333332},{"$f":"J60/('HFVsf-_-4 - Heizen'!$E$11-'HFVsf-_-4 - Heizen'!$E$15)","v":-27.937996333333331},{"$f":"L59","v":24.911542830000002},24.915727378791882,{"$f":"M60*('HFVsf-_-4 - Heizen'!$E$18-'HFVsf-_-4 - Heizen'!$E$11)","v":822.21900350013209},710.46701816679877,null,{"$f":"(((N60*3.6)-('HFVsf-_-4 - Heizen'!$E$19*4.19*'HFVsf-_-4 - Heizen'!$E$18))/('HFVsf-_-4 - Heizen'!$E$19*4.19))*-1","v":47.93558851408001},{"$f":"'HFVsf-_-4 - Heizen'!$E$18-Q60","v":7.0644114859199902},null,104.76748624999999,"! ? !","V4","Reihe 1 - offen / Reihe 3+4 - offen",null,null,null,null,{"$f":"G60/$AL$82*$AM$82","v":52.383743124999995},31.358638928121596,33.531946111590692,{"$f":"(AB60*('HFVsf-_-4 - Heizen'!$E$15-'HFVsf-_-4 - Heizen'!$E$11)/3)","v":-69.844990833333327},{"$f":"AE60/('HFVsf-_-4 - Heizen'!$E$11-'HFVsf-_-4 - Heizen'!$E$15)","v":-17.461247708333332},null,16.406003453736595,{"$f":"AH60*('HFVsf-_-4 - Heizen'!$E$18-'HFVsf-_-4 - Heizen'!$E$11)","v":541.39811397330766},471.55312313997433,null,{"$f":"(((AI60*3.6)-('HFVsf-_-4 - Heizen'!$E$19*4.19*'HFVsf-_-4 - Heizen'!$E$18))/('HFVsf-_-4 - Heizen'!$E$19*4.19))*-1","v":50.348369426482321},{"$f":"'HFVsf-_-4 - Heizen'!$E$18-AL60","v":4.6516305735176786},null,83.148798611111104,"! ? !","V4","Reihe 1 - offen / Reihe 3+4 - offen",null,null,null,null,{"$f":"G60/$AL$82*$AN$82","v":103.45789267187499},34.314309927746386,36.487617111215485,{"$f":"(AW60*('HFVsf-_-4 - Heizen'!$E$15-'HFVsf-_-4 - Heizen'!$E$11)/3)","v":-137.94385689583331},{"$f":"AZ60/('HFVsf-_-4 - Heizen'!$E$11-'HFVsf-_-4 - Heizen'!$E$15)","v":-34.485964223958327},null,30.730366206981355,{"$f":"BC60*('HFVsf-_-4 - Heizen'!$E$18-'HFVsf-_-4 - Heizen'!$E$11)","v":1014.1020848303847},876.15822793455141,null,{"$f":"(((BD60*3.6)-('HFVsf-_-4 - Heizen'!$E$19*4.19*'HFVsf-_-4 - Heizen'!$E$18))/('HFVsf-_-4 - Heizen'!$E$19*4.19))*-1","v":46.28695106112319},{"$f":"'HFVsf-_-4 - Heizen'!$E$18-BG60","v":8.7130489388768098},null,103.45789267187499,"! ? !"]
["V5","Reihe 1 - offen / Reihe 3+4 - offen / Reihe 2 - halb offen",null,null,null,null,{"$f":" 0.00001643*'HFVsf-_-4 - Heizen'!E14*'HFVsf-_-4 - Heizen'!E14*'HFVsf-_-4 - Heizen'!E14 - 0.00778044*'HFVsf-_-4 - Heizen'!E14*'HFVsf-_-4 - Heizen'!E14 + 1.57165254*'HFVsf-_-4 - Heizen'!E14","v":95.790853999999996},{"$f":" 0.00001677*G61*G61*G61 - 0.00520804*G61*G61 + 0.72331681*G61 - 3.76279164+1","v":33.476214904634517},{"$f":" 0.000005*G61*G61*G61 - 0.00228525*G61*G61 + 0.58129671*G61 - 4.48854499","v":34.61999649866879},{"$f":"(G61*('HFVsf-_-4 - Heizen'!$E$15-'HFVsf-_-4 - Heizen'!$E$11)/3)","v":-127.72113866666666},{"$f":"J61/('HFVsf-_-4 - Heizen'!$E$11-'HFVsf-_-4 - Heizen'!$E$15)","v":-31.930284666666665},{"$f":" -0.00063357*G61*G61 + 0.3306984*G61 + 2.08120134","v":27.945516315977656},{"$f":" (-0.00364427*$K$6*$K$6 + 0.92168068*$K$6 + 44.27454669)*(L61/100)","v":27.945492475657687},{"$f":"M61*('HFVsf-_-4 - Heizen'!$E$18-'HFVsf-_-4 - Heizen'!$E$11)","v":922.20125169670371},794.48011303003705,null,{"$f":"(((N61*3.6)-('HFVsf-_-4 - Heizen'!$E$19*4.19*'HFVsf-_-4 - Heizen'!$E$18))/('HFVsf-_-4 - Heizen'!$E$19*4.19))*-1","v":47.076552491388703},{"$f":"'HFVsf-_-4 - Heizen'!$E$18-Q61","v":7.9234475086112965},null,119.73856749999999,"! ? !","V5","Reihe 1 - offen / Reihe 3+4 - offen / Reihe 2 - halb offen",null,null,null,null,{"$f":"G61/$AL$84*$AM$84","v":58.409057317073163},{"$f":"H61+(10*LOG(($AM$84)/($AL$84)))","v":31.327776424157538},{"$f":"I61+(10*LOG(($AM$84)/($AL$84)))","v":32.471558018191814},{"$f":"(AB61*('HFVsf-_-4 - Heizen'!$E$15-'HFVsf-_-4 - Heizen'!$E$11)/3)","v":-77.878743089430884},{"$f":"AE61/('HFVsf-_-4 - Heizen'!$E$11-'HFVsf-_-4 - Heizen'!$E$15)","v":-19.469685772357721},null,18.400981801649511,{"$f":"AH61*('HFVsf-_-4 - Heizen'!$E$18-'HFVsf-_-4 - Heizen'!$E$11)","v":607.2323994544339},529.35365636500296,null,{"$f":"(((AI61*3.6)-('HFVsf-_-4 - Heizen'!$E$19*4.19*'HFVsf-_-4 - Heizen'!$E$18))/('HFVsf-_-4 - Heizen'!$E$19*4.19))*-1","v":49.782728787503672},{"$f":"'HFVsf-_-4 - Heizen'!$E$18-AL61","v":5.2172712124963283},null,92.71278939217963,"! ? !","V5","Reihe 1 - offen / Reihe 3+4 - offen / Reihe 2 - halb offen",null,null,null,null,{"$f":"G61/$AL$84*$AN$84","v":119.15447692682926},{"$f":"H61+(10*LOG(($AN$84)/($AL$84)))","v":34.424078098416523},{"$f":"I61+(10*LOG(($AN$84)/($AL$84)))","v":35.567859692450796},{"$f":"(AW61*('HFVsf-_-4 - Heizen'!$E$15-'HFVsf-_-4 - Heizen'!$E$11)/3)","v":-158.87263590243901},{"$f":"AZ61/('HFVsf-_-4 - Heizen'!$E$11-'HFVsf-_-4 - Heizen'!$E$15)","v":-39.718158975609754},null,34.467194336954691,{"$f":"BC61*('HFVsf-_-4 - Heizen'!$E$18-'HFVsf-_-4 - Heizen'!$E$11)","v":1137.4174131195048},978.54477721706576,null,{"$f":"(((BD61*3.6)-('HFVsf-_-4 - Heizen'!$E$19*4.19*'HFVsf-_-4 - Heizen'!$E$18))/('HFVsf-_-4 - Heizen'!$E$19*4.19))*-1","v":45.22743988727872},{"$f":"'HFVsf-_-4 - Heizen'!$E$18-BG61","v":9.7725601127212798},null,119.15447692682926,"! ? !"]
["V6","alles offen - Boost",null,null,null,null,{"$f":" 0.00001944*'HFVsf-_-4 - Heizen'!E14*'HFVsf-_-4 - Heizen'!E14*'HFVsf-_-4 - Heizen'!E14 - 0.00899448*'HFVsf-_-4 - Heizen'!E14*'HFVsf-_-4 - Heizen'!E14 + 1.7594462*'HFVsf-_-4 - Heizen'!E14","v":105.43982},{"$f":" -0.000015*G62*G62*G62 + 0.00599418*G62*G62 - 0.59801586*G62 + 46.24012038+1","v":33.242569435009337},{"$f":" -0.00003432*G62*G62*G62 + 0.01224967*G62*G62 - 1.18836976*G62 + 63.60257406","v":34.256429474184038},{"$f":"(G62*('HFVsf-_-4 - Heizen'!$E$15-'HFVsf-_-4 - Heizen'!$E$11)/3)","v":-140.58642666666665},{"$f":"J62/('HFVsf-_-4 - Heizen'!$E$11-'HFVsf-_-4 - Heizen'!$E$15)","v":-35.146606666666663},{"$f":" -0.00033599*'HFVsf-_-4 - Heizen'!E14*'HFVsf-_-4 - Heizen'!E14 + 0.1700803*'HFVsf-_-4 - Heizen'!E14 + 16.00088101","v":29.649011009999999},{"$f":" (-0.00364427*$K$6*$K$6 + 0.92168068*$K$6 + 44.27454669)*(L62/100)","v":29.648985716428705},{"$f":"M62*('HFVsf-_-4 - Heizen'!$E$18-'HFVsf-_-4 - Heizen'!$E$11)","v":978.41652864214723},837.8301019754806,null,{"$f":"(((N62*3.6)-('HFVsf-_-4 - Heizen'!$E$19*4.19*'HFVsf-_-4 - Heizen'!$E$18))/('HFVsf-_-4 - Heizen'!$E$19*4.19))*-1","v":46.593557271809715},{"$f":"'HFVsf-_-4 - Heizen'!$E$18-Q62","v":8.4064427281902852},null,131.79977499999998,"! ? !","V6","alles offen - Boost",null,null,null,null,{"$f":"G62/$AL$84*$AM$84","v":64.2925731707317},{"$f":"H62+(10*LOG(($AM$84)/($AL$84)))","v":31.094130954532357},{"$f":"I62+(10*LOG(($AM$84)/($AL$84)))","v":32.107990993707062},{"$f":"(AB62*('HFVsf-_-4 - Heizen'!$E$15-'HFVsf-_-4 - Heizen'!$E$11)/3)","v":-85.723430894308933},{"$f":"AE62/('HFVsf-_-4 - Heizen'!$E$11-'HFVsf-_-4 - Heizen'!$E$15)","v":-21.430857723577233},null,19.522663523664782,{"$f":"AH62*('HFVsf-_-4 - Heizen'!$E$18-'HFVsf-_-4 - Heizen'!$E$11)","v":644.24789628093777},558.52446538662889,null,{"$f":"(((AI62*3.6)-('HFVsf-_-4 - Heizen'!$E$19*4.19*'HFVsf-_-4 - Heizen'!$E$18))/('HFVsf-_-4 - Heizen'!$E$19*4.19))*-1","v":49.464695879209124},{"$f":"'HFVsf-_-4 - Heizen'!$E$18-AL62","v":5.535304120790876},null,102.05170344560587,"! ? !","V6","alles offen - Boost",null,null,null,null,{"$f":"G62/$AL$84*$AN$84","v":131.15684926829269},{"$f":"H62+(10*LOG(($AN$84)/($AL$84)))","v":34.190432628791342},{"$f":"I62+(10*LOG(($AN$84)/($AL$84)))","v":35.204292667966044},{"$f":"(AW62*('HFVsf-_-4 - Heizen'!$E$15-'HFVsf-_-4 - Heizen'!$E$11)/3)","v":-174.87579902439026},{"$f":"AZ62/('HFVsf-_-4 - Heizen'!$E$11-'HFVsf-_-4 - Heizen'!$E$15)","v":-43.718949756097565},null,36.568235591907978,{"$f":"BC62*('HFVsf-_-4 - Heizen'!$E$18-'HFVsf-_-4 - Heizen'!$E$11)","v":1206.7517745329633},1031.875975508573,null,{"$f":"(((BD62*3.6)-('HFVsf-_-4 - Heizen'!$E$19*4.19*'HFVsf-_-4 - Heizen'!$E$18))/('HFVsf-_-4 - Heizen'!$E$19*4.19))*-1","v":44.631726996852827},{"$f":"'HFVsf-_-4 - Heizen'!$E$18-BG62","v":10.368273003147173},null,131.15684926829269,"! ? !"]
[]
[]
[null,null,null,null,null,null,null,{"$f":"H42","v":29.125283427196237},{"$f":"H43","v":28.341039915907007},{"$f":"H44","v":28.343902905835371},{"$f":"H46","v":30.947496353604194},{"$f":"H47","v":33.399838754680843},{"$f":"H48","v":33.476214904634517},{"$f":"H49","v":33.242569435009337},null,null,null,null,null,null,null,null,null,null,null,null,null,null,{"$f":"AC42","v":26.976844946719257},{"$f":"AC43","v":26.258280491636182},{"$f":"AC44","v":26.261143481564545},{"$f":"AC46","v":28.906296527044947},{"$f":"AC47","v":31.358638928121596},{"$f":"AC48","v":31.327776424157538},{"$f":"AC49","v":31.094130954532357},null,null,null,null,null,null,null,null,null,null,null,null,null,null,{"$f":"AX42","v":30.073146620978246},{"$f":"AX43","v":29.268580448275994},{"$f":"AX44","v":29.271443438204358},{"$f":"AX46","v":31.861967526669737},{"$f":"AX47","v":34.314309927746386},{"$f":"AX48","v":34.424078098416523},{"$f":"AX49","v":34.190432628791342}]
[null,null,null,null,null,null,null,{"$f":"I42","v":29.125283427196237},{"$f":"I43","v":28.341039915907007},{"$f":"I44","v":28.343902905835371},{"$f":"I46","v":31.380800793302782},{"$f":"I47","v":35.573145938149942},{"$f":"I48","v":34.61999649866879},{"$f":"I49","v":34.256429474184038},null,null,null,null,null,null,null,null,null,null,null,null,null,null,{"$f":"AD42","v":26.976844946719257},{"$f":"AD43","v":26.258280491636182},{"$f":"AD44","v":26.261143481564545},{"$f":"AD46","v":29.339600966743536},{"$f":"AD47","v":33.531946111590692},{"$f":"AD48","v":32.471558018191814},{"$f":"AD49","v":32.107990993707062},null,null,null,null,null,null,null,null,null,null,null,null,null,null,{"$f":"AY42","v":30.073146620978246},{"$f":"AY43","v":29.268580448275994},{"$f":"AY44","v":29.271443438204358},{"$f":"AY46","v":32.295271966368325},{"$f":"AY47","v":36.487617111215485},{"$f":"AY48","v":35.567859692450796},{"$f":"AY49","v":35.204292667966044}]
[]
[null,null,null,null,null,null,null,{"$f":"H55","v":29.125283427196237},{"$f":"H56","v":28.341039915907007},{"$f":"H57","v":28.343902905835371},{"$f":"H59","v":30.947496353604194},{"$f":"H60","v":33.399838754680843},{"$f":"H61","v":33.476214904634517},{"$f":"H62","v":33.242569435009337},null,null,null,null,null,null,null,null,null,null,null,null,null,null,{"$f":"AC55","v":26.976844946719257},{"$f":"AC56","v":26.258280491636182},{"$f":"AC57","v":26.261143481564545},{"$f":"AC59","v":28.906296527044947},{"$f":"AC60","v":31.358638928121596},{"$f":"AC61","v":31.327776424157538},{"$f":"AC62","v":31.094130954532357},null,null,null,null,null,null,null,null,null,null,null,null,null,null,{"$f":"AX55","v":30.073146620978246},{"$f":"AX56","v":29.268580448275994},{"$f":"AX57","v":29.271443438204358},{"$f":"AX59","v":31.861967526669737},{"$f":"AX60","v":34.314309927746386},{"$f":"AX61","v":34.424078098416523},{"$f":"AX62","v":34.190432628791342}]
[null,null,null,null,null,null,null,{"$f":"I55","v":29.125283427196237},{"$f":"I56","v":28.341039915907007},{"$f":"I57","v":28.343902905835371},{"$f":"I59","v":31.380800793302782},{"$f":"I60","v":35.573145938149942},{"$f":"I61","v":34.61999649866879},{"$f":"I62","v":34.256429474184038},null,null,null,null,null,null,null,null,null,null,null,null,null,null,{"$f":"AD55","v":26.976844946719257},{"$f":"AD56","v":26.258280491636182},{"$f":"AD57","v":26.261143481564545},{"$f":"AD59","v":29.339600966743536},{"$f":"AD60","v":33.531946111590692},{"$f":"AD61","v":32.471558018191814},{"$f":"AD62","v":32.107990993707062},null,null,null,null,null,null,null,null,null,null,null,null,null,null,{"$f":"AY55","v":30.073146620978246},{"$f":"AY56","v":29.268580448275994},{"$f":"AY57","v":29.271443438204358},{"$f":"AY59","v":32.295271966368325},{"$f":"AY60","v":36.487617111215485},{"$f":"AY61","v":35.567859692450796},{"$f":"AY62","v":35.204292667966044}]
[]
[]
[]
["Technische Daten Baugröße 630 "]
["Einstellbereich Stufe 1",null,null,null,null,null,null,null,null,null,null,null,null,null,null,null,null,null,null,null,null,null,null,null,null,null,null,null,null,null,null,null,null,null,null,null,"Umrechnung der Düsenanzahl auf anderen Baugrößen"]
["Dp","VP",null,null,"LwA - MQ System",null,null,"LwA - MQQ System",null,null,"QP/DtP",null,null,"Qk/Dt",null,null,"Qh/Dt",null,null,null,"QEk = 210 W (T_Wasservorlauf=60°C)"]
["[Pa]","[m3/h]",null,null,"[dB(A)]",null,null,"[dB(A)]",null,null,"[W/K]",null,null,"[W/K]",null,null,"[W/K]",null,null,null,"m = -- kg",null,null,null,null,null,null,null,null,null,null,null,null,null,null,null,"BG",800,630,1000,"Neutralen Düsen"]
[null,"V0","V1","V2","V0","V1","V2","V0","V1","V2","V0","V1","V2","V0","V1","V2","V0","V1","V2",null,"wok / Dpw = 120 / 8 [kg/h] / [kPa]",null,null,null,null,null,null,null,null,null,null,null,null,null,null,null,"Düsen Stufe 1",21,13,26,3]
[{"$f":"A105","v":70},{"$f":"B105/$AL$84*$AM$84","v":3.6725559756097557},10.070505182926828,{"$f":"D105/$AL$77*$AM$77","v":16.320809699999998},{"$f":"E105+(10*LOG($AM$84/$AL$84))","v":27.531102147036865},{"$f":"F105+(10*LOG($AM$77/$AL$77))","v":24.963403993885567},25.706971115010809,27.596781203243019,24.963403993885567,25.706971115010809,{"$f":"B78/3","v":1.224185325203252},3.3568350609756092,5.4402698999999997,0,{"$f":"(O105/$AL$86*$AM$86)*0.9","v":11.322443086797255},16.315474449212847,4.5501703354962943,11.056500581753035,14.457311440961963,null,"woh / Dpw = 100 / 2 [kg/h] / [kPa]",null,null,null,null,null,null,null,null,null,null,null,null,null,null,null,"Düsen Stufe 2a",22,14,26,2]
[{"$f":"A106","v":100},4.5924353658536585,12.422460365853659,{"$f":"D106/$AL$77*$AM$77","v":20.158875285714281},{"$f":"E106+(10*LOG($AM$84/$AL$84))","v":26.976844946719257},26.258280491636182,26.261143481564545,27.042524002925411,26.258280491636182,26.261143481564545,1.5308117886178862,4.1408201219512195,6.7196250952380936,0,13.382459424759938,19.841930309298448,4.5501703354962943,12.473632871815155,16.406003453736595,null,null,null,null,null,null,null,null,null,null,null,null,null,null,null,null,null,"Düsen Stufe 2b",21,13,27,3]
[{"$f":"A107","v":150},5.6924945121951227,15.077410060975611,{"$f":"D107/$AL$77*$AM$77","v":24.270895071428573},{"$f":"E107+(10*LOG($AM$84/$AL$84))","v":29.976312382164725},27.592919022148944,27.860770877019874,30.041991438370879,27.592919022148944,27.860770877019874,1.8974981707317076,5.0258033536585369,8.0902983571428582,0,16.388719652040255,24.04048837463564,4.5501703354962943,14.565137379465305,19.004130654409177,null,"Legende",null,null,null,null,null,null,null,null,null,null,null,null,null,null,null,"Düsen Boost",18,10,23,4]
[null,null,null,null,null,null,null,null,null,null,null,null,null,null,null,null,null,null,null,null,"Dp ","- Statischer Druck am Primärluftstutzen"]
["Einstellbereich Stufe 2",null,null,null,null,null,null,null,null,null,null,null,null,null,null,null,null,null,null,null,"VP ","- Primärluftvolumenstrom (±10 %)",null,null,null,null,null,null,null,null,null,null,null,null,null,null,"Reihe 1+2a+2b",{"$f":"AL77+AL78+AL79","v":64},{"$f":"AM77+AM78+AM79","v":40},{"$f":"AN77+AN78+AN79","v":79}]
["Dp","VP",null,null,"LwA - MQ System",null,null,"LwA - MQQ System",null,null,"QP/DtP",null,null,"Qk/Dt",null,null,"Qh/Dt",null,null,null,"LwA ","- Schallleistungspegel (±3 dB)"]
["[Pa]","[m3/h]",null,null,"[dB(A)]",null,null,"[dB(A)]",null,null,"[W/K]",null,null,"[W/K]",null,null,"[W/K]",null,null,null,"QP ","- Kühlleistung primär (Frischluftanteil) (±5 %)",null,null,null,null,null,null,null,null,null,null,null,null,null,null,"Gesamt Düsenanzahl",{"$f":"AL77+AL78+AL79+AL80","v":82},{"$f":"AM77+AM78+AM79+AM80","v":50},{"$f":"AN77+AN78+AN79+AN80","v":102}]
[null,"V2","V3","V4","V2","V3","V4","V2","V3","V4","V2","V3","V4",null,null,null,null,null,null,null,"Qk ","- Kühlleistung sekundär (über Wärmet.) (±5 %)"]
[{"$f":"A113","v":70},{"$f":"D78","v":16.320809699999998},{"$f":"C113/$AL$82*$AM$82","v":29.892977624999997},41.652996437500001,{"$f":"G78","v":25.706971115010809},{"$f":"F113+(10*LOG(($AM$77+$AM$78+$AM$79)/($AL$77+$AL$78+$AL$79)))","v":27.558879854611636},28.19100013483834,{"$f":"J78","v":25.706971115010809},{"$f":"I113+(10*LOG(($AM$77+$AM$78+$AM$79)/($AL$77+$AL$78+$AL$79)))","v":26.352755540960938},28.469077394351327,{"$f":"B86/3","v":5.4402698999999997},9.9643258749999983,13.884332145833334,{"$f":"P78","v":16.315474449212847},null,null,{"$f":"S78","v":14.457311440961963},null,null,null,"Qh ","- Heizleistung sekundär (±5 %)",null,null,null,null,null,null,null,null,null,null,null,null,null,null,"Länge des Wärmeübertragers",857,627,1057,"mm"]
[{"$f":"A114","v":100},{"$f":"D79","v":20.158875285714281},36.607259999999997,52.383743124999995,{"$f":"G79","v":26.261143481564545},28.906296527044947,31.358638928121596,{"$f":"J79","v":26.261143481564545},29.339600966743536,33.531946111590692,6.7196250952380936,12.202419999999998,17.461247708333332,{"$f":"P79","v":19.841930309298448},null,null,{"$f":"S79","v":16.406003453736595},null,null,null,"QEk ","- Heizleistung Eigenkonvektion",null,null,null,null,null,null,null,null,null,null,null,null,null,null,"Länge des Kastens",{"$f":"48.8+44+(699.2+30)","v":822},{"$f":"AM86-(AL86-AL87)","v":592},{"$f":"AN86-(AM86-AM87)","v":1022},"mm"]
[{"$f":"A115","v":150},{"$f":"D80","v":24.270895071428573},43.872155624999998,64.951770937500001,{"$f":"G80","v":27.860770877019874},32.258427589076803,35.002677626477094,{"$f":"J80","v":27.860770877019874},33.787853521061237,38.852994968221822,8.0902983571428582,14.624051874999999,21.6505903125,{"$f":"P80","v":24.04048837463564},null,null,{"$f":"S80","v":19.004130654409177},null,null,null,"m ","- Gewicht",null,null,null,null,null,null,null,null,null,null,null,null,null,null,"Hub (Abstand zwischen Düsen)",31.7,31.7,31.7,"mm"]
[null,null,null,null,null,null,null,null,null,null,null,null,null,null,null,null,null,null,null,null,"wok ","- Nennwassermenge bei Kühlleistung"]
["Einstellbereich Booststufe",null,null,null,null,null,null,null,null,null,null,null,null,null,null,null,null,null,null,null,"woh ","- Nennwassermenge bei Heizleistung",null,null,null,null,null,null,null,null,null,null,null,null,null,null,"Booststufe"]
["Dp","VP",null,null,"LwA - MQ System",null,null,"LwA - MQQ System",null,null,"QP/DtP",null,null,"Qk/Dt",null,null,"Qh/Dt",null,null,null,"Dt ","- Temperaturdifferenz zwischen Ansaugtemperatur vor Wärmetauscher und Wasservorlauf",null,null,null,null,null,null,null,null,null,null,null,null,null,null,"75 Pa",89.565764999999999,{"$f":"$AM$84*AL95","v":54.61327134146341},{"$f":"$AN$84*AL95","v":111.41107353658535},"m³/h"]
["[Pa]","[m3/h]",null,null,"[dB(A)]",null,null,"[dB(A)]",null,null,"[W/K]",null,null,"[W/K]",null,null,"[W/K]",null,null,null,"DtP","- Temperaturdifferenz zwischen Raum- und Primärluft",null,null,null,null,null,null,null,null,null,null,null,null,null,null,"100 Pa",105.43982,{"$f":"$AM$84*AL96","v":64.2925731707317},{"$f":"$AN$84*AL96","v":131.15684926829269},"m³/h"]
[null,"V4","V5","V6","V4","V5","V6","V4","V5","V6","V4","V5","V6","V4","V5","V6","V4","V5","V6",null,"Dpw ","- Wasserseitiger Druckverlust",null,null,null,null,null,null,null,null,null,null,null,null,null,null,"150 Pa",127.15113000000002,{"$f":"$AM$84*AL97","v":77.531176829268304},{"$f":"$AN$84*AL97","v":158.16360073170736},"m³/h"]
[{"$f":"A121","v":70},{"$f":"D86","v":41.652996437500001},{"$f":"C121/$AL$84*$AM$84","v":47.272568170731716},52.290367073170728,{"$f":"G86","v":28.19100013483834},{"$f":"F121+(10*LOG(($AM$84)/($AL$84)))","v":27.67709961007138},28.430140129304238,{"$f":"J86","v":28.469077394351327},{"$f":"I121+(10*LOG(($AM$84)/($AL$84)))","v":27.023717311776419},27.985359801922836,{"$f":"B94/3","v":13.884332145833334},15.757522723577239,17.430122357723576,{"$f":"(N121/$AL$86*$AM$86)*0.9","v":16.315474449212847},17.828358140926287,20.878408608951407,14.457311440961963,15.744567075720905,17.291237541648304,null,null,null,null,null,null,null,null,null,null,null,null,null,null,null,null,null,"Vp / Düse"]
[{"$f":"A122","v":100},{"$f":"D87","v":52.383743124999995},58.409057317073163,64.2925731707317,{"$f":"G87","v":31.358638928121596},31.327776424157538,31.094130954532357,{"$f":"J87","v":33.531946111590692},32.471558018191814,32.107990993707062,17.461247708333332,19.469685772357721,21.430857723577233,19.841930309298448,23.227818192060024,25.31911586140221,16.406003453736595,18.400981801649511,19.522663523664782,null,null,null,null,null,null,null,null,null,null,null,null,null,null,null,null,null,"75 Pa",{"$f":"AL91/$AL$84","v":1.0922654268292682},{"$f":"AM91/$AM$84","v":1.0922654268292682},{"$f":"AN91/$AN$84","v":1.0922654268292682}]
[{"$f":"A123","v":150},{"$f":"D88","v":64.951770937500001},70.816604268292693,77.531176829268304,{"$f":"G88","v":35.002677626477094},35.117107276182942,35.128087885265586,{"$f":"J88","v":38.852994968221822},37.882800027350996,37.845237143452138,21.6505903125,23.605534756097565,25.843725609756103,24.04048837463564,27.708487812180067,29.598797176349787,19.004130654409177,21.032808496542881,22.356764025378162,null,null,null,null,null,null,null,null,null,null,null,null,null,null,null,null,null,"100 Pa",{"$f":"AL92/$AL$84","v":1.2858514634146341},{"$f":"AM92/$AM$84","v":1.2858514634146341},{"$f":"AN92/$AN$84","v":1.2858514634146343}]
[null,null,null,null,null,null,null,null,null,null,null,null,null,null,null,null,null,null,null,null,null,null,null,null,null,null,null,null,null,null,null,null,null,null,null,null,"150 Pa",{"$f":"AL93/$AL$84","v":1.5506235365853662},{"$f":"AM93/$AM$84","v":1.550623536585366},{"$f":"AN93/$AN$84","v":1.5506235365853662}]
[]
[]
["Technische Daten Baugröße 800"]
["Einstellbereich Stufe 1"]
["Dp","VP",null,null,"LwA - MQ System",null,null,"LwA - MQQ System",null,null,"QP/DtP",null,null,"Qk/Dt",null,null,"Qh/Dt",null,null,null,"QEk = 290 W (T_Wasservorlauf=60°C)"]
["[Pa]","[m3/h]",null,null,"[dB(A)]",null,null,"[dB(A)]",null,null,"[W/K]",null,null,"[W/K]",null,null,"[W/K]",null,null,null,"m = -- kg",null,null,{"$f":"X104*100/120","v":100}]
[null,"V0","V1","V2","V0","V1","V2","V0","V1","V2","V0","V1","V2","V0","V1","V2","V0","V1","V2",null,"wok / Dpw = 120 /10 [kg/h] / [kPa]",null,null,120,"Kg/h"]
[70,{"$f":" 0.0000012*A105*A105*A105 - 0.00056156*A105*A105 + 0.11947194*A105","v":6.0229917999999998},{"$f":" 0.0000037*A105*A105*A105 - 0.00170264*A105*A105 + 0.33699235*A105","v":16.515628499999998},{"$f":" 0.00000518*A105*A105*A105 - 0.00258029*A105*A105 + 0.53187237*A105","v":26.364384899999997},{"$f":" -0.09683515*B105*B105*B105 + 2.82937202*B105*B105 - 25.31985844*B105+ 100.69909147","v":29.679540627513845},{"$f":" 0.00318987*C105*C105*C105 - 0.20009878*C105*C105 + 4.44969236*C105 - 6.23321246","v":27.046163418156393},{"$f":" 0.00079259*D105*D105*D105 - 0.06598958*D105*D105 + 1.90619065*D105 + 8.87776506","v":27.789730539281635},{"$f":"  -0.09683515*B105*B105*B105 + 2.82937202*B105*B105 - 25.31985844*B105 + 100.69909147","v":29.679540627513845},{"$f":" 0.00318987*C105*C105*C105 - 0.20009878*C105*C105+ 4.44969236*C105 - 6.23321246","v":27.046163418156393},{"$f":" 0.00079259*D105*D105*D105 - 0.06598958*D105*D105 + 1.90619065*D105 + 8.87776506","v":27.789730539281635},{"$f":"B105/3","v":2.0076639333333333},5.5052094999999994,8.7881282999999986,0,{"$f":"(-0.00000005*$X$103*$X$103*$X$103*$X$103 + 0.00003436*$X$103*$X$103*$X$103 - 0.00954651*$X$103*$X$103 + 1.23090664*$X$103 + 42.5961506)*((-0.00016284*A105*A105 + 0.13240544*A105 + 8.7971089)/100)","v":17.195345960278658},{"$f":"(( -0.0006401*A105*A105 + 0.28808731*A105 + 7.85269878)/100)*(-0.00000005*$X$103*$X$103*$X$103*$X$103 + 0.00003436*$X$103*$X$103*$X$103 - 0.00954651*$X$103*$X$103 + 1.23090664*$X$103 + 42.5961506)","v":24.778241366250949},{"$f":"((( -0.00044271*$AA$107*$AA$107*$AA$107 + 0.08535026*$AA$107*$AA$107 + 4.57471629*$AA$107)/$AA$107)/100)*(0.00002283*$X$105*$X$105*$X$105 - 0.00884453*$X$105*$X$105 + 1.25881688*$X$105 + 39.75040963)","v":6.9103242557510614},{"$f":"((-0.00010264*A105*A105 + 0.08917651*A105 + 11.04922042)/100)*(0.00002283*$X$105*$X$105*$X$105 - 0.00884453*$X$105*$X$105 + 1.25881688*$X$105 + 39.75040963)","v":16.79146021364939},{"$f":"( (-0.00024663*A105*A105 + 0.14055954*A105 + 13.32188883)/100)*(0.00002283*$X$105*$X$105*$X$105 - 0.00884453*$X$105*$X$105+ 1.25881688*$X$105 + 39.75040963)","v":21.956257141421943},null,"woh / Dpw = 100 / 3 [kg/h] / [kPa]",null,null,100,"Kg/h","TVL",55]
[100,{"$f":" 0.0000012*A106*A106*A106 - 0.00056156*A106*A106 + 0.11947194*A106","v":7.5315940000000001},{"$f":" 0.0000037*A106*A106*A106 - 0.00170264*A106*A106 + 0.33699235*A106","v":20.372835000000002},{"$f":" 0.00000518*A106*A106*A106 - 0.00258029*A106*A106 + 0.53187237*A106","v":32.564336999999995},{"$f":" -0.09683515*B106*B106*B106 + 2.82937202*B106*B106 - 25.31985844*B106+ 100.69909147","v":29.125283427196237},{"$f":" 0.00318987*C106*C106*C106 - 0.20009878*C106*C106 + 4.44969236*C106 - 6.23321246","v":28.341039915907007},{"$f":" 0.00079259*D106*D106*D106 - 0.06598958*D106*D106 + 1.90619065*D106 + 8.87776506","v":28.343902905835371},{"$f":"  -0.09683515*B106*B106*B106 + 2.82937202*B106*B106 - 25.31985844*B106 + 100.69909147","v":29.125283427196237},{"$f":" 0.00318987*C106*C106*C106 - 0.20009878*C106*C106+ 4.44969236*C106 - 6.23321246","v":28.341039915907007},{"$f":" 0.00079259*D106*D106*D106 - 0.06598958*D106*D106 + 1.90619065*D106 + 8.87776506","v":28.343902905835371},2.5105313333333332,6.7909450000000007,10.854778999999999,0,{"$f":"(-0.00000005*$X$103*$X$103*$X$103*$X$103 + 0.00003436*$X$103*$X$103*$X$103 - 0.00954651*$X$103*$X$103 + 1.23090664*$X$103 + 42.5961506)*((-0.00016284*A106*A106 + 0.13240544*A106 + 8.7971089)/100)","v":20.323883974870224},{"$f":"(( -0.0006401*A106*A106 + 0.28808731*A106 + 7.85269878)/100)*(-0.00000005*$X$103*$X$103*$X$103*$X$103 + 0.00003436*$X$103*$X$103*$X$103 - 0.00954651*$X$103*$X$103 + 1.23090664*$X$103 + 42.5961506)","v":30.133854820253006},{"$f":"((( -0.00044271*$AA$107*$AA$107*$AA$107 + 0.08535026*$AA$107*$AA$107 + 4.57471629*$AA$107)/$AA$107)/100)*(0.00002283*$X$105*$X$105*$X$105 - 0.00884453*$X$105*$X$105 + 1.25881688*$X$105 + 39.75040963)","v":6.9103242557510614},{"$f":"((-0.00010264*A106*A106 + 0.08917651*A106 + 11.04922042)/100)*(0.00002283*$X$105*$X$105*$X$105 - 0.00884453*$X$105*$X$105 + 1.25881688*$X$105 + 39.75040963)","v":18.94365297030939},{"$f":"( (-0.00024663*A106*A106 + 0.14055954*A106 + 13.32188883)/100)*(0.00002283*$X$105*$X$105*$X$105 - 0.00884453*$X$105*$X$105+ 1.25881688*$X$105 + 39.75040963)","v":24.915727378791882},null,null,null,null,null,null,"TRaum",22]
[150,{"$f":" 0.0000012*A107*A107*A107 - 0.00056156*A107*A107 + 0.11947194*A107","v":9.3356910000000006},{"$f":" 0.0000037*A107*A107*A107 - 0.00170264*A107*A107 + 0.33699235*A107","v":24.726952499999999},{"$f":" 0.00000518*A107*A107*A107 - 0.00258029*A107*A107 + 0.53187237*A107","v":39.206830500000002},{"$f":" -0.09683515*B107*B107*B107 + 2.82937202*B107*B107 - 25.31985844*B107+ 100.69909147","v":32.124750862641704},{"$f":" 0.00318987*C107*C107*C107 - 0.20009878*C107*C107 + 4.44969236*C107 - 6.23321246","v":29.67567844641977},{"$f":" 0.00079259*D107*D107*D107 - 0.06598958*D107*D107 + 1.90619065*D107 + 8.87776506","v":29.9435303012907},{"$f":"  -0.09683515*B107*B107*B107 + 2.82937202*B107*B107 - 25.31985844*B107 + 100.69909147","v":32.124750862641704},{"$f":" 0.00318987*C107*C107*C107 - 0.20009878*C107*C107+ 4.44969236*C107 - 6.23321246","v":29.67567844641977},{"$f":" 0.00079259*D107*D107*D107 - 0.06598958*D107*D107 + 1.90619065*D107 + 8.87776506","v":29.9435303012907},3.1118970000000004,8.2423175000000004,13.068943500000001,0,{"$f":"(-0.00000005*$X$103*$X$103*$X$103*$X$103 + 0.00003436*$X$103*$X$103*$X$103 - 0.00954651*$X$103*$X$103 + 1.23090664*$X$103 + 42.5961506)*((-0.00016284*A107*A107 + 0.13240544*A107 + 8.7971089)/100)","v":24.889478542970934},{"$f":"(( -0.0006401*A107*A107 + 0.28808731*A107 + 7.85269878)/100)*(-0.00000005*$X$103*$X$103*$X$103*$X$103 + 0.00003436*$X$103*$X$103*$X$103 - 0.00954651*$X$103*$X$103 + 1.23090664*$X$103 + 42.5961506)","v":36.510187022971365},{"$f":"((( -0.00044271*$AA$107*$AA$107*$AA$107 + 0.08535026*$AA$107*$AA$107 + 4.57471629*$AA$107)/$AA$107)/100)*(0.00002283*$X$105*$X$105*$X$105 - 0.00884453*$X$105*$X$105 + 1.25881688*$X$105 + 39.75040963)","v":6.9103242557510614},{"$f":"((-0.00010264*A107*A107 + 0.08917651*A107 + 11.04922042)/100)*(0.00002283*$X$105*$X$105*$X$105 - 0.00884453*$X$105*$X$105 + 1.25881688*$X$105 + 39.75040963)","v":22.120011933726325},{"$f":"( (-0.00024663*A107*A107 + 0.14055954*A107 + 13.32188883)/100)*(0.00002283*$X$105*$X$105*$X$105 - 0.00884453*$X$105*$X$105+ 1.25881688*$X$105 + 39.75040963)","v":28.861492062428965},null,"Legende",null,null,null,null,null,{"$f":"AA105-AA106","v":33}]
[null,null,null,null,null,null,null,null,null,null,null,null,null,null,null,null,null,null,null,null,"Dp ","- Statischer Druck am Primärluftstutzen"]
["Einstellbereich Stufe 2",null,null,null,null,null,null,null,null,null,null,null,null,null,null,null,null,null,null,null,"VP ","- Primärluftvolumenstrom (±10 %)"]
["Dp","VP",null,null,"LwA - MQ System",null,null,"LwA - MQQ System",null,null,"QP/DtP",null,null,"Qk/Dt",null,null,"Qh/Dt",null,null,null,"LwA ","- Schallleistungspegel (±3 dB)"]
["[Pa]","[m3/h]",null,null,"[dB(A)]",null,null,"[dB(A)]",null,null,"[W/K]",null,null,"[W/K]",null,null,"[W/K]",null,null,null,"QP ","- Kühlleistung primär (Frischluftanteil) (±5 %)"]
[null,"V2","V3","V4","V2","V3","V4","V2","V3","V4","V2","V3","V4",null,null,null,null,null,null,null,"Qk ","- Kühlleistung sekundär (über Wärmet.) (±5 %)"]
[70,{"$f":"D105","v":26.364384899999997},{"$f":" 0.00001121*A113*A113*A113 - 0.00515743*A113*A113 + 0.98935916*A113","v":47.828764199999995},{"$f":" 0.00001114*A113*A113*A113 - 0.00569142*A113*A113 + 1.29588189*A113","v":66.644794300000001},{"$f":"G105","v":27.789730539281635},{"$f":" -0.00016693*C113*C113*C113 + 0.03676497*C113*C113 - 2.36419998*C113 + 75.33789138+1.5","v":29.600079681170882},{"$f":" 0.00002138*D113*D113*D113 - 0.00552666*D113*D113 + 0.65145656*D113+ 3.53424824+1.5","v":30.232199961397587},{"$f":"J105","v":27.789730539281635},{"$f":" -0.00014494*C113*C113*C113+ 0.03027476*C113*C113- 1.70837942*C113 + 56.70564023","v":28.393955367520185},{"$f":" 0.00001549*D113*D113*D113 - 0.00475234*D113*D113 + 0.74577555*D113- 2.66924058","v":30.510277220910574},{"$f":"B113/3","v":8.7881282999999986},15.942921399999998,22.214931433333334,{"$f":"P105","v":24.778241366250949},null,null,{"$f":"S105","v":21.956257141421943},null,null,null,"Qh ","- Heizleistung sekundär (±5 %)"]
[100,{"$f":"D106","v":32.564336999999995},{"$f":" 0.00001121*A114*A114*A114 - 0.00515743*A114*A114 + 0.98935916*A114","v":58.571615999999999},{"$f":" 0.00001114*A114*A114*A114 - 0.00569142*A114*A114 + 1.29588189*A114","v":83.813988999999992},{"$f":"G106","v":28.343902905835371},{"$f":" -0.00016693*C114*C114*C114 + 0.03676497*C114*C114 - 2.36419998*C114 + 75.33789138+1.5","v":30.947496353604194},{"$f":" 0.00002138*D114*D114*D114 - 0.00552666*D114*D114 + 0.65145656*D114+ 3.53424824+1.5","v":33.399838754680843},{"$f":"J106","v":28.343902905835371},{"$f":" -0.00014494*C114*C114*C114+ 0.03027476*C114*C114- 1.70837942*C114 + 56.70564023","v":31.380800793302782},{"$f":" 0.00001549*D114*D114*D114 - 0.00475234*D114*D114 + 0.74577555*D114- 2.66924058","v":35.573145938149942},10.854778999999999,19.523872000000001,27.937996333333331,{"$f":"P106","v":30.133854820253006},null,null,{"$f":"S106","v":24.915727378791882},null,null,null,"QEk ","- Heizleistung Eigenkonvektion"]
[150,{"$f":"D107","v":39.206830500000002},{"$f":" 0.00001121*A115*A115*A115 - 0.00515743*A115*A115 + 0.98935916*A115","v":70.195448999999996},{"$f":" 0.00001114*A115*A115*A115 - 0.00569142*A115*A115 + 1.29588189*A115","v":103.9228335},{"$f":"G107","v":29.9435303012907},{"$f":" -0.00016693*C115*C115*C115 + 0.03676497*C115*C115 - 2.36419998*C115 + 75.33789138+1.5","v":34.299627415636053},{"$f":" 0.00002138*D115*D115*D115 - 0.00552666*D115*D115 + 0.65145656*D115+ 3.53424824+1.5","v":37.043877453036345},{"$f":"J107","v":29.9435303012907},{"$f":" -0.00014494*C115*C115*C115+ 0.03027476*C115*C115- 1.70837942*C115 + 56.70564023","v":35.829053347620487},{"$f":" 0.00001549*D115*D115*D115 - 0.00475234*D115*D115 + 0.74577555*D115- 2.66924058","v":40.894194794781072},13.068943500000001,23.398482999999999,34.640944499999996,{"$f":"P107","v":36.510187022971365},null,null,{"$f":"S107","v":28.861492062428965},null,null,null,"m ","- Gewicht"]
[null,null,null,null,null,null,null,null,null,null,null,null,null,null,null,null,null,null,null,null,"wok ","- Nennwassermenge bei Kühlleistung"]
["Einstellbereich Booststufe",null,null,null,null,null,null,null,null,null,null,null,null,null,null,null,null,null,null,null,"woh ","- Nennwassermenge bei Heizleistung"]
["Dp","VP",null,null,"LwA - MQ System",null,null,"LwA - MQQ System",null,null,"QP/DtP",null,null,"Qk/Dt",null,null,"Qh/Dt",null,null,null,"Dt ","- Temperaturdifferenz zwischen Ansaugtemperatur vor Wärmetauscher und Wasservorlauf"]
["[Pa]","[m3/h]",null,null,"[dB(A)]",null,null,"[dB(A)]",null,null,"[W/K]",null,null,"[W/K]",null,null,"[W/K]",null,null,null,"DtP","- Temperaturdifferenz zwischen Raum- und Primärluft"]
[null,"V4","V5","V6","V4","V5","V6","V4","V5","V6","V4","V5","V6","V4","V5","V6","V4","V5","V6",null,"Dpw ","- Wasserseitiger Druckverlust"]
[70,{"$f":"D113","v":66.644794300000001},{"$f":" 0.00001643*A121*A121*A121 - 0.00778044*A121*A121 + 1.57165254*A121","v":77.527011800000011},{"$f":" 0.00001944*A121*A121*A121 - 0.00899448*A121*A121 + 1.7594462*A121","v":85.756202000000002},{"$f":"G113","v":30.232199961397587},{"$f":" 0.00001677*C121*C121*C121 - 0.00520804*C121*C121+ 0.72331681*C121 - 3.76279164+1","v":29.82553809054836},{"$f":" -0.000015*D121*D121*D121 + 0.00599418*D121*D121 - 0.59801586*D121 + 46.24012038+1","v":30.578578609781218},{"$f":"J113","v":30.510277220910574},{"$f":" 0.000005*C121*C121*C121 - 0.00228525*C121*C121 + 0.58129671*C121 - 4.48854499","v":29.172155792253399},{"$f":" -0.00003432*D121*D121*D121 + 0.01224967*D121*D121 - 1.18836976*D121 + 63.60257406","v":30.133798282399816},{"$f":"B121/3","v":22.214931433333334},25.842337266666672,28.585400666666668,{"$f":"N113","v":24.778241366250949},{"$f":"(( 0.00000724*C121*C121*C121 - 0.00507231*C121*C121 + 1.16582334*C121 - 36.10721949)/100)*(-0.00000006*$X$103*$X$103*$X$103*$X$103 + 0.0000435*$X$103*$X$103*$X$103 - 0.01202881*$X$103*$X$103 + 1.5521255*$X$103 + 27.25688021)","v":27.07585136766583},{"$f":" ((0.00000418*A121*A121*A121 - 0.00252654*A121*A121 + 0.56349124*A121 + 3.31123587)/100)*(-0.00000006*$X$103*$X$103*$X$103*$X$103 + 0.0000435*$X$103*$X$103*$X$103 - 0.01202881*$X$103*$X$103 + 1.5521255*$X$103 + 27.25688021)","v":31.707949987367275},{"$f":"Q113","v":21.956257141421943},{"$f":"( (-0.00063357*C121*C121 + 0.3306984*C121 + 2.08120134)/100)*(-0.00364427*$X$105*$X$105 + 0.92168068*$X$105 + 44.27454669)","v":23.91120677634736},{"$f":"(( -0.00033599*A121*A121 + 0.1700803*A121 + 16.00088101)/100)*(-0.00364427*$X$105*$X$105 + 0.92168068*$X$105 + 44.27454669)","v":26.260128607465173}]
[100,{"$f":"D114","v":83.813988999999992},{"$f":" 0.00001643*A122*A122*A122 - 0.00778044*A122*A122 + 1.57165254*A122","v":95.790853999999996},{"$f":" 0.00001944*A122*A122*A122 - 0.00899448*A122*A122 + 1.7594462*A122","v":105.43982},{"$f":"G114","v":33.399838754680843},{"$f":" 0.00001677*C122*C122*C122 - 0.00520804*C122*C122+ 0.72331681*C122 - 3.76279164+1","v":33.476214904634517},{"$f":" -0.000015*D122*D122*D122 + 0.00599418*D122*D122 - 0.59801586*D122 + 46.24012038+1","v":33.242569435009337},{"$f":"J114","v":35.573145938149942},{"$f":" 0.000005*C122*C122*C122 - 0.00228525*C122*C122 + 0.58129671*C122 - 4.48854499","v":34.61999649866879},{"$f":" -0.00003432*D122*D122*D122 + 0.01224967*D122*D122 - 1.18836976*D122 + 63.60257406","v":34.256429474184038},27.937996333333331,31.930284666666665,35.146606666666663,{"$f":"N114","v":30.133854820253006},{"$f":"(( 0.00000724*C122*C122*C122 - 0.00507231*C122*C122 + 1.16582334*C122 - 36.10721949)/100)*(-0.00000006*$X$103*$X$103*$X$103*$X$103 + 0.0000435*$X$103*$X$103*$X$103 - 0.01202881*$X$103*$X$103 + 1.5521255*$X$103 + 27.25688021)","v":35.27598828742768},{"$f":" ((0.00000418*A122*A122*A122 - 0.00252654*A122*A122 + 0.56349124*A122 + 3.31123587)/100)*(-0.00000006*$X$103*$X$103*$X$103*$X$103 + 0.0000435*$X$103*$X$103*$X$103 - 0.01202881*$X$103*$X$103 + 1.5521255*$X$103 + 27.25688021)","v":38.452033126389679},{"$f":"Q114","v":24.915727378791882},{"$f":"( (-0.00063357*C122*C122 + 0.3306984*C122 + 2.08120134)/100)*(-0.00364427*$X$105*$X$105 + 0.92168068*$X$105 + 44.27454669)","v":27.945492475657687},{"$f":"(( -0.00033599*A122*A122 + 0.1700803*A122 + 16.00088101)/100)*(-0.00364427*$X$105*$X$105 + 0.92168068*$X$105 + 44.27454669)","v":29.648985716428705}]
[150,{"$f":"D115","v":103.9228335},{"$f":" 0.00001643*A123*A123*A123 - 0.00778044*A123*A123 + 1.57165254*A123","v":116.13923100000001},{"$f":" 0.00001944*A123*A123*A123 - 0.00899448*A123*A123 + 1.7594462*A123","v":127.15113000000002},{"$f":"G115","v":37.043877453036345},{"$f":" 0.00001677*C123*C123*C123 - 0.00520804*C123*C123+ 0.72331681*C123 - 3.76279164+1","v":37.265545756659918},{"$f":" -0.000015*D123*D123*D123 + 0.00599418*D123*D123 - 0.59801586*D123 + 46.24012038+1","v":37.276526365742562},{"$f":"J115","v":40.894194794781072},{"$f":" 0.000005*C123*C123*C123 - 0.00228525*C123*C123 + 0.58129671*C123 - 4.48854499","v":40.031238507827972},{"$f":" -0.00003432*D123*D123*D123 + 0.01224967*D123*D123 - 1.18836976*D123 + 63.60257406","v":39.993675623929114},34.640944499999996,38.713077000000006,42.383710000000008,{"$f":"N115","v":36.510187022971365},{"$f":"(( 0.00000724*C123*C123*C123 - 0.00507231*C123*C123 + 1.16582334*C123 - 36.10721949)/100)*(-0.00000006*$X$103*$X$103*$X$103*$X$103 + 0.0000435*$X$103*$X$103*$X$103 - 0.01202881*$X$103*$X$103 + 1.5521255*$X$103 + 27.25688021)","v":42.080762103558953},{"$f":" ((0.00000418*A123*A123*A123 - 0.00252654*A123*A123 + 0.56349124*A123 + 3.31123587)/100)*(-0.00000006*$X$103*$X$103*$X$103*$X$103 + 0.0000435*$X$103*$X$103*$X$103 - 0.01202881*$X$103*$X$103 + 1.5521255*$X$103 + 27.25688021)","v":44.951566861831942},{"$f":"Q115","v":28.861492062428965},{"$f":"( (-0.00063357*C123*C123 + 0.3306984*C123 + 2.08120134)/100)*(-0.00364427*$X$105*$X$105 + 0.92168068*$X$105 + 44.27454669)","v":31.942436437244812},{"$f":"(( -0.00033599*A123*A123 + 0.1700803*A123 + 16.00088101)/100)*(-0.00364427*$X$105*$X$105 + 0.92168068*$X$105 + 44.27454669)","v":33.953122044566868}]
[]
[]
[]
["Technische Daten Baugröße 1000"]
["Einstellbereich Stufe 1"]
["Dp","VP",null,null,"LwA - MQ System",null,null,"LwA - MQQ System",null,null,"QP/DtP",null,null,"Qk/Dt",null,null,"Qh/Dt",null,null,null,"QEk = 355 W (T_Wasservorlauf=60°C)"]
["[Pa]","[m3/h]",null,null,"[dB(A)]",null,null,"[dB(A)]",null,null,"[W/K]",null,null,"[W/K]",null,null,"[W/K]",null,null,null,"m = -- kg"]
[null,"V0","V1","V2","V0","V1","V2","V0","V1","V2","V0","V1","V2","V0","V1","V2","V0","V1","V2",null,"wok / Dpw = 120 / 11 [kg/h] / [kPa]"]
[{"$f":"A105","v":70},{"$f":"B105/$AL$84*$AN$84","v":7.4920141902439017},20.54383057317073,{"$f":"D105/$AL$77*$AN$77","v":32.641619399999996},{"$f":"E105+(10*LOG($AN$84/$AL$84))","v":30.627403821295854},{"$f":"F105+(10*LOG($AN$77/$AL$77))","v":27.97370395052538},28.717271071650622,30.607081159882831,27.97370395052538,28.717271071650622,{"$f":"B132/3","v":2.497338063414634},6.8479435243902431,10.880539799999999,0,{"$f":"O105/$AL$86*$AN$86","v":21.208262170378696},30.560794777278009,8.5230020283884151,20.710120706916459,27.080237804530913,null,"woh / Dpw = 100 / 5 [kg/h] / [kPa]"]
[{"$f":"A106","v":100},9.3685681463414632,25.341819146341468,{"$f":"D106/$AL$77*$AN$77","v":40.317750571428562},{"$f":"E106+(10*LOG($AN$84/$AL$84))","v":30.073146620978246},29.268580448275994,29.271443438204358,30.052823959565224,29.268580448275994,29.271443438204358,3.1228560487804877,8.4472730487804899,13.439250190476187,0,25.066914074023135,37.16625967912185,8.5230020283884151,23.364575483800493,30.730366206981355]
[{"$f":"A107","v":150},11.612688804878049,30.757916524390243,{"$f":"D107/$AL$77*$AN$77","v":48.541790142857145},{"$f":"E107+(10*LOG($AN$84/$AL$84))","v":33.07261405642371},30.603218978788757,30.871070833659687,33.052291395010691,30.603218978788757,30.871070833659687,3.8708962682926829,10.252638841463414,16.180596714285716,0,30.697991621843965,45.030650738950683,8.5230020283884151,27.282208417676461,35.596962788783451,null,"Legende"]
[null,null,null,null,null,null,null,null,null,null,null,null,null,null,null,null,null,null,null,null,"Dp ","- Statischer Druck am Primärluftstutzen"]
["Einstellbereich Stufe 2",null,null,null,null,null,null,null,null,null,null,null,null,null,null,null,null,null,null,null,"VP ","- Primärluftvolumenstrom (±10 %)"]
["Dp","VP",null,null,"LwA - MQ System",null,null,"LwA - MQQ System",null,null,"QP/DtP",null,null,"Qk/Dt",null,null,"Qh/Dt",null,null,null,"LwA ","- Schallleistungspegel (±3 dB)"]
["[Pa]","[m3/h]",null,null,"[dB(A)]",null,null,"[dB(A)]",null,null,"[W/K]",null,null,"[W/K]",null,null,"[W/K]",null,null,null,"QP ","- Kühlleistung primär (Frischluftanteil) (±5 %)"]
[null,"V2","V3","V4","V2","V3","V4","V2","V3","V4","V2","V3","V4",null,null,null,null,null,null,null,"Qk ","- Kühlleistung sekundär (über Wärmet.) (±5 %)"]
[{"$f":"A113","v":70},{"$f":"D132","v":32.641619399999996},{"$f":"C113/$AL$82*$AN$82","v":59.038630809374993},82.264667964062497,{"$f":"G132","v":28.717271071650622},{"$f":"F113+(10*LOG(($AN$77+$AN$78+$AN$79)/($AL$77+$AL$78+$AL$79)))","v":30.514550854236425},31.14667113446313,{"$f":"J132","v":28.717271071650622},{"$f":"I113+(10*LOG(($AN$77+$AN$78+$AN$79)/($AL$77+$AL$78+$AL$79)))","v":29.308426540585728},31.424748393976117,{"$f":"B140/3","v":10.880539799999999},19.679543603124998,27.421555988020831,{"$f":"P132","v":30.560794777278009},null,null,{"$f":"S132","v":27.080237804530913},null,null,null,"Qh ","- Heizleistung sekundär (±5 %)"]
[{"$f":"A114","v":100},{"$f":"D133","v":40.317750571428562},72.299338500000005,103.45789267187499,{"$f":"G133","v":29.271443438204358},31.861967526669737,34.314309927746386,{"$f":"J133","v":29.271443438204358},32.295271966368325,36.487617111215485,13.439250190476187,24.0997795,34.485964223958327,{"$f":"P133","v":37.16625967912185},null,null,{"$f":"S133","v":30.730366206981355},null,null,null,"QEk ","- Heizleistung Eigenkonvektion"]
[{"$f":"A115","v":150},{"$f":"D134","v":48.541790142857145},86.647507359374998,128.27974760156249,{"$f":"G134","v":30.871070833659687},35.214098588701596,37.958348626101888,{"$f":"J134","v":30.871070833659687},36.74352452068603,41.808665967846615,16.180596714285716,28.882502453124999,42.759915867187495,{"$f":"P134","v":45.030650738950683},null,null,{"$f":"S134","v":35.596962788783451},null,null,null,"m ","- Gewicht"]
[null,null,null,null,null,null,null,null,null,null,null,null,null,null,null,null,null,null,null,null,"wok ","- Nennwassermenge bei Kühlleistung"]
["Einstellbereich Booststufe",null,null,null,null,null,null,null,null,null,null,null,null,null,null,null,null,null,null,null,"woh ","- Nennwassermenge bei Heizleistung"]
["Dp","VP",null,null,"LwA - MQ System",null,null,"LwA - MQQ System",null,null,"QP/DtP",null,null,"Qk/Dt",null,null,"Qh/Dt",null,null,null,"Dt ","- Temperaturdifferenz zwischen Ansaugtemperatur vor Wärmetauscher und Wasservorlauf"]
["[Pa]","[m3/h]",null,null,"[dB(A)]",null,null,"[dB(A)]",null,null,"[W/K]",null,null,"[W/K]",null,null,"[W/K]",null,null,null,"DtP","- Temperaturdifferenz zwischen Raum- und Primärluft"]
[null,"V4","V5","V6","V4","V5","V6","V4","V5","V6","V4","V5","V6","V4","V5","V6","V4","V5","V6",null,"Dpw ","- Wasserseitiger Druckverlust"]
[{"$f":"A121","v":70},{"$f":"D140","v":82.264667964062497},{"$f":"C121/$AL$84*$AN$84","v":96.4360390682927},106.67234882926829,{"$f":"G140","v":31.14667113446313},{"$f":"F121+(10*LOG(($AN$84)/($AL$84)))","v":30.773401284330369},31.526441803563227,{"$f":"J140","v":31.424748393976117},{"$f":"I121+(10*LOG(($AN$84)/($AL$84)))","v":30.120018986035408},31.081661476181825,{"$f":"B148/3","v":27.421555988020831},32.145346356097569,35.557449609756098,{"$f":"N121/$AL$86*$AN$86","v":30.560794777278009},33.394603145417484,39.107704943579009,27.080237804530913,29.49141839276448,32.388513346663579]
[{"$f":"A122","v":100},{"$f":"D141","v":103.45789267187499},119.15447692682926,131.15684926829269,{"$f":"G141","v":34.314309927746386},34.424078098416523,34.190432628791342,{"$f":"J141","v":36.487617111215485},35.567859692450796,35.204292667966044,34.485964223958327,39.718158975609754,43.718949756097565,37.16625967912185,43.50842429382854,47.425669795325426,30.730366206981355,34.467194336954691,36.568235591907978]
[{"$f":"A123","v":150},{"$f":"D142","v":128.27974760156249},144.46587270731709,158.16360073170736,{"$f":"G142","v":37.958348626101888},38.213408950441924,38.224389559524568,{"$f":"J142","v":41.808665967846615},40.979101701609977,40.94153881771112,42.759915867187495,48.155290902439027,52.721200243902452,45.030650738950683,51.901243341262322,55.442014204149778,35.596962788783451,39.396914018865537,41.876837807592977]

{"sheet":"Legende","index":3,"n_rows":176,"n_cols":22,"rows_kept":176,"cut":false,"hidden":true,"merged":[]}
[null,null,null,null,null,null,"Tel.  +49 (0)711 8201-180   Fax -720"]
["LTG Aktiengesellschaft"]
[null,null,null,null,null,null,null,null,null,null,null,null,null,null,null,null,null,null,null,null,null,"Deutsch"]
[]
[null,"Deutsch","English","Francais","Italiano","Portugues","Turkish"]
[null,"Legende für LTG Auslegungstabellen","Legend for LTG Selection Sheets",null,"Legenda per le tabelle prestazioni di LTG "]
["x","Sprache:","Language:","Langue:","Lingua","Idioma:","Lisan"]
["x","Datum:","Date:","Data:","Data","Data:","Tarih"]
["x","Bearbeiter:","Editor:","Responsable:","Responsabile","Responsável:","Hazirlayan"]
["x","Projekt:","Project:","Projet:","Progetto","Projecto:","Proje"]
["x","Variante:","Alternative:","Variante:","Variante","Variante:","Alternatif"]
[null,"LTG Schlitzdurchlässe Typ LDB und LDB System Clean","LTG Linear Diffusers Type LDB and LDB System Clean","LTG Diffuseurs linéaires type LDB et LDB Système CLEAN","Diffusori lineari LTG tipo LDB e LDB System clean","Difusores lineares LTG, LDB e LDB System Clean ","LTG Lineer Slot Difüzör Tip LDB ve LDB Temiz Sistem "]
["x","Induktionsgerät HFVsf - System smart flow, 4-Leiter-System","LTG Induction Unit Type HFVsf - System smart flow, 4-pipe system - cooling and heating"]
["x","relative Feuchte","Relative room air humidity",null,"Umiditá relativa dell' area ambiente","Umidade relativa do ar na sala:"]
["x","Auslegunsbedingungen:","Room Conditions:","Donées du Local:","Condizioni:","Condicoes:"]
["x","Taupunkttemperatur Raumluft","Dew point temperatur of room air",null,"Temperature del punto di rugiada area ambiente","Ponto der condensacao"]
["x","Wassergehalt Raumluft","Humidity ration of room air",null,"Umiditá especifica dell' area ambiente","Umidade specífica do ar na sala:"]
["x"," => Ablufttemperatur"," => Extract air temperature",null," => Temperature dell' area estratta"]
["x","Bemerkungen:","Notes:",null,"Note:"]
["x","Primärseite (Luftseite):","Primary Side (Air side):"]
["x","Primärdruck","Primary pressure"]
["x","Primärlufttemperatur","Primary air temperatur"]
["x","Sekundärseite (Wasserseite):","Secondary Side (Water Side):"]
["x","Wasservorlauftemperatur","Water inlet temperature"]
["x","Wassermassenstrom","Water flow rate"]
["x","Wasserrücklauftemperatur","Water outlet temperature"]
["x","Wasserseitiger Druckverlust","Differential pressure (water side)"]
["x","Sekundärleistung","Secondary capacity"]
["x","Sekundärleistung - Qk","Secondary capacity - Qk"]
["x","Sekundärleistung - Qh","Secondary capacity - Qh"]
["x","Primärleistung - Qp","Primary capacity - Qp"]
["x","Primärleistung","Primary capacity"]
["x","Bereich:","Range:"]
["x","Betriebszustände (Stellung Düsenklappe)","Operating modes of nozzle slide damper"]
["x","Einstellung Düsenklappe (Primärluftmenge)","Adjustment of nozzle slide damper (primary air flow rate)"]
["x","Geräte Baugröße","Terminal Size"]
["x","Kühlen","Cooling"]
["x","Heizen","Heating"]
["x","Einstellung Düsenklappe","Adjustment of nozzle slide damper"]
["X","Leistung [W]","Capacity [W]"]
["x","Gesamt Kühlleistung - Q","Total cooling capacity - Q"]
["x","Gesamt Heizleistung - Q","Total heating capacity - Q"]
["x","Gesamt Kühlleistung","Total cooling capacity"]
["x","Gesamt Heizleistung","Total heating capacity"]
["x","Primärvolumenstrom - Vp","Primary air volume rate - Vp"]
["x","Schallleistungspegel - MQ Gerät","Sound power level - MQ Unit"]
["x","Schallleistungspegel - MQQ Gerät","Sound power level - MQQ Unit"]
["x","Schallleistungspegel [dB(A)]","Sound power level [dB(A)]"]
["x","Raumströmung","Air flow pattern"]
["x","Regelbereich","Adjustment range"]
["x","V0 - geschlossen","V0 - slide damper closed "]
["x","V1 - geringe Primärluftmenge 1, geringe Induktion","V1 - low primary air flow rate including induced secondary air - level 1"]
["x","V2 - geringe Primärluftmenge 2, mittlere Induktion","V2 - low primary air flow rate including induced secondary air - level 2"]
["x","V3 - mittlere Primärluftmenge 1, mittlere Induktion","V3 - additional primary air flow rate - level 1, including induced secondary air - level 2"]
["x","V4 – mittlere Primärluftmenge 2,  mittlere Induktion","V4 - additional primary air flow rate - level 2, including induced secondary air - level 2"]
["x","V5 - Booststufe 1, hohe Induktion","V5 - Boost Level 1 with additional induction"]
["x","V6 - Booststufe 2, hohe Induktion","V6 - Boost Level 2 with additional induction"]
["x","Toleranz +/- 3 dB","Tolerance +/- 3 dB"]
[null,"Primärvolumenstrom - Vp [m³/h]","Primary air volume rate - Vp [m³/h]"]
["x","© LTG Aktiengesellschaft - Letzte Änderung: 13.03.2012","© LTG Aktiengesellschaft - Last update: 13.03.2012","LTG Aktiengesellschaft-Version du 30.12.09","© LTG Aktiengesellschaft - Ultimo aggiornamento : 30.12.2009","© LTG Aktiengesellschaft - Última actualização: 30.12.2009","© LTG Aktiengesellschaft - Son Guncelleme: 15.12.2009"]
["x","Angaben zu Toleranzen sowie weitere Spezifikationen sind der aktuellen LTG Bauteilmappe zu entnehmen.","Data for tolerances and other specification are published in LTG technical literature","Voir classeur actuel pour informations complementaires et tolerances des donnés techniques","Dati sulle tolleranze e altre specifiche sono pubblicate sulla documentazione LTG","Os dados técnicos relativos a tolerâncias e outras especificações encontram-se nas publicações técnicas  da LTG","LTG Teknik Literaturunde yayinlanmis diger spesifikasyon  ve  Tolerans degeri. "]
["x","Eine Fehlerfreiheit des Programms kann nicht zugesichert werden. Im Zweifel gelten die technischen Daten der aktuellen LTG Bauteilmappe.","Accuracy of selection software can not be ensured. In case of doubts data of LTG technical literature is valid.","Sous Réserve des erreurs du programme, en cas de doute il faut utiliser les données techniques du prospectus valable","i dati pubblicati sui cataloghi LTG sono validi","Não podemos garantir a total inexistência de erros no programa. Em caso de incerteza a literatura técnica da LTG prevalece.","Secim programinin dogrulugu teyid edilemez. Suphe olusmasi halinde LTG Teknik dokumanlari gecerlidir. "]
["x","Aus Programmierfehlern entstandener Schaden geht nicht zu Lasten der LTG. Technische Änderungen im Rahmen der Weiterentwicklung vorbehalten.","Damage caused by programming errors is not at LTG expenses. Subject to technical specifications.","LTG Aktiengesellschaft refuse la résponsabilite d`erreurs de programmer y compris Dommage eventuel causé par le programme.","Danni per errori nei programmi di selezione non possono essere addebitati a LTG.Soggetti a specifiche tecniche.","Os prejuízos resultantes do uso deste programa não são da responsabilidade da LTG. Sugeito a rectificações técnicas.","Secim nedeni ile olusabilecek kayiplardan dolayi LTG sorumlu tutulamaz."]
[null,"Raumdaten:","Room data:","Donées du Local","Dati del locale","Dados da sala:","Oda No"]
[null,"Raumbezeichnung","Room name","Designation du Local","Identificazione del locale","Designação da sala:","Oda Ismi"]
[null,"Soll-Gesamtvolumenstrom","Target total air flow rate","Debit d`air demandée","Portata aria di progetto","Caudal total pretendido:","Hedef Toplam Hava Miktari"]
[null,"Raumlufttemperatur","Room air temperature","Temperature ambient","Temperatura nell' ambiente","Temperatura do ar na sala:","Oda Havası Sıcakligi"]
[null,"Zuluftuntertemperatur","Supply air temperature difference","Difference de Temperature de l´air neuf","Differenza di temperatura con aria di mandata","DT na insuflação:","Ufleme Havasi Sicaklik Farki"]
[null,"Raum-Schallabsorption","Room sound absorpion","Attenuation du local","Attenuazione sonora del locale","Capacidade de absorção de som pela sala","Oda Ses Yutumu"]
[null,"LDB Typ","LDB Type","Designation du type LDB","Dati del modello LDB","Referência dos LDB","LDB Tip Spesifikasyonu"]
[null,"Einbauhöhe H=2,80 m","Installation height H=2,80 m","hauteur installation H=2,8 m","Altezza di installazione H = 2,8 m","Altura de instalação H= 2,8 m","Montaj Yuksekligi H=2.80 m "]
[null,"Einbauhöhe H=5,00 m","Installation height H=5,00 m","hauteur installation H=5,0 m","Altezza di installazione H = 5,0  m","Altura de instalação H= 5 m","Montaj Yuksekligi H=5.00 m "]
[null,"Spezifischer Volumenstrom","Specific air flow rate","Debit d`air specifique par 1 m","Portata aria specifica","Caudal de ar por m","Spesifik Hava Debi Degeri"]
[null,"Empfehlung max.","Recommen-dation max.","Recommandation maxi.","Massima raccomandata","Máximo recomendado","Tavsiye Edilen max."]
[null,"Schlitzlänge Element","Diffuser element length","Longuer diffuseur par element","Lunghezza elemento diffusore","Comprimento dos elementos do difusor","Difuzor Elemani Uzunlugu"]
[null,"Stückzahl","Quantity","Quantité","Quantità","Quantidade","Miktar"]
[null,"Schlitzlänge Gesamt Raum","Diffuser length total room","Longueur diffuseur total par local","Lunghezza totale diffusori nel locale ","Comprimento total do difusor na sala","Oda Toplam Difuzor Uzunlugu "]
[null,"Druckverlust","Pressure loss","Perte pression","Caduta di pressione ","Perda de carga","Basinc Kayibi"]
[null,"Strahl-Ausbreitung Zuluft","Jet spreading supply air ","Penetration du jet de l`air neuf","Lunghezza del getto aria di mandata","Penetração do jacto de ar insuflado","Ufleme Havasi Jet Yayilma"]
[null,"Max. Luft-Geschwind.","Max. air velocity","Velocité maximale","Velocità massima aria ","Velocidade máxima do ar","Max. Hava Hizi"]
[null,"Aufentaltszone","Occupied zone","Zone occupé","Zona occupata","Zona ocupada","Yasama Bolgesi"]
[null,"Zugluft-risiko","Draught risk","Risque vitesse trop elevé","Rischio spiffero","Risco de corrente de ar","Cereyan Riski"]
[null,"Kategorie gemäß DIN EN ISO 7730","Category       DIN EN ISO 7730","Classe sélon DIN EN ISO 7730","Categoria secondo DIN EN ISO 7730","Categoria           DIN EN ISO 7730","Kategori DIN EN ISO 7730"]
[null,"Bewertung der thermischen Behaglichkeit","Evaluation of thermal comfort","Variante","Valutazione comfort termico","Avaliação do conforto térmico","Termik Konfor Degerlendirmesi"]
[null,"A-bewerteter Schall-leistungs-pegel pro Element","A-rated sound power level per element","Niveau puissance sonore par element","Potenza sonora per elemento in scala A","Pressão sonora, por elemento, medida na escala A","A-Ses Basinci Seviyesi Element Basina"]
[null,"Ist-Gesamt- volumen- strom","Actual total air flow rate","Debit d´air totale","Portata aria totale ","Caudal total","Gercek Toplam Hava Debisi Degeri"]
[null,"Schalldruckpegel im Raum","Sound pressure level in the room","Niveau pression sonore du local","Pressione sonora risultante nel locale","Pressão sonora na sala","Res. Oda Ses Basinci Seviyesi "]
[null,"Strömungsakkustik","Airborne noise","Niveau sonore","Rumorosità portata dall' aria","Nível sonoro na sala","Hava ile Tasinan Ses"]
[null,"Stck","pc.","pc.","pz.","pc.","Miktar"]
[null,"<= Typ Wählen!","<= Select type!","<= Choisir type s.v.p.","<= Modello selezionato ","<= Seleccione o modelo!","<=Tip Sec"]
[]
[]
[]
[null,"Aus Programmierfehlern entstandener Schaden geht nicht zu Lasten der LTG. Technische Änderungen im Rahmen der Weiterentwicklung vorbehalten.","Damage caused by programming errors is not at LTG expenses. Subject to technical specifications.","LTG Aktiengesellschaft refuse la résponsabilite d`erreurs de programmer y compris Dommage eventuel causé par le programme.","Danni per errori nei programmi di selezione non possono essere addebitati a LTG.Soggetti a specifiche tecniche.","Os prejuízos resultantes do uso deste programa não são da responsabilidade da LTG. Sugeito a rectificações técnicas.","Secim nedeni ile olusabilecek kayiplardan dolayi LTG sorumlu tutulamaz."]
[null,"Büro:","Office:","Bureau","Ufficio","Escritório:","Ofis"]
[null,"kleiner Büroraum:","Small office room:","bureau cellulaire","Ufficio piccolo","Pequeno escritório:","Kucuk Ofis"]
[null,"Großraumbüro:","Open-plan office:","bureau vaste","Ufficio spazio aperto","Escritório \"Open Space\":","Acik Ofis"]
[null,"Besprechungsraum:","Meeting room:","Salle conference","Sala riunioni","Sala de reuniões:","Toplanti Odasi"]
[null,"Wohngebäude:","Residential building:","appartements","Appartamenti","Edifício residêncial:","Rezidans Binasi"]
[null,"Wohn-/Schlafräume:","Living- and sleeping room:","Chambre a choucher","Soggiorno\\ Camera da letto","Sala/ Quarto de dormir:","Oturma / Uyku Odasi"]
[null,"Krankenhaus:","Hospital:","Hôpital","Ospedale","Hospital:","Hastane "]
[null,"Bettenzimmer:","Bedroom:","Salle a lits","Camera da letto","Quarto de dormir:","Yatak Odasi"]
[null,"Hallen, Korridore:","Hall, Corridor","Corridor","Ingresso, Corridoio","Hall, corredor:","Hol, Koridor"]
[null,"Untersuchungsräume:","Medical inspection rooms","Salles du recherche","Ambulatorio medico","Consoltório médico:","Arastirma Odasi"]
[null,"OP-Räume:","Operation rooms","Salles operation","Sala operatoria ","Sala de cirurgia:","Operasyon Odasi "]
[null,"Sport:","Sport:","Sport","Sport","Desporto:","Spor "]
[null,"Turnhallen:","Sportshalls","Halles du sport","Palestra","Ginásio:","Spor Holu"]
[null,"Schwimmbäder:","Swimming pool:","Piscines","Piscina","Piscina:","Yuzme Havuzu"]
[null,"Versammlungssäle:","Conference rooms","Salles conferences","Sala conferenze","Sala de espectáculos","Toplantı Salonlari"]
[null,"Theater:","Theatre:","Theatres","Teatro","Teatro:","Tiyatro"]
[null,"Opernhaus:","Opera house","Opera","Teatro d' opera","Opera:","Opera Evi"]
[null,"Konzertsaal:","Concert hall","Salles du concerts","Sala concerti","Sala de concertos:","Konser Salonu"]
[null,"Kino, Hörsaal, Lesesaal:","Cinema, auditorium","Salles du cinema","Cinema, Auditorium, Biblioteca","Cinema, Auditório:","Sinema, Oditoryum"]
[null,"Kirche:","Church:","Eglises","Chiesa","Igreja:","Kilise / Cami"]
[null,"Studios:","Studios:","Studios d´enregistrement","Sala di registrazione","Estúdio:","Studyo"]
[null,"Rundfunkstudio:","Radio studio","Studios Radio","Studio Radiofonico","Estúdio de rádio:","Radyo Studyosu"]
[null,"Fernsehstudio:","TV studio","Studios TV","Sudio Televisivo","Estúdio de TV:","TV Studyosu"]
[null,"Sonstige:","Others:","Autres","Altro","Outros:","Diger"]
[null,"Gaststätten:","Restaurants:","Restaurants","Ristorante","Restaurante:","Resturant"]
[null,"Museen:","Museeum:","Musees","Museo","Museu:","Muze"]
[null,"Klassenräume:","Class rooms:","Salles du classes","Aula scolastica","Sala de Aula:","Dershane"]
[null,"Volumenstrom","Air flow rate","Debit d`air","Portata aria","Caudal de ar"]
[null,"A-bewerteter Schallleistungspegel","A-rated sound power level","Niveau puissance sonore ","Potenza sonora in scala A","Pressão sonora,medida na escala A","A-Ses Basinci Seviyesi "]
[null,"Kategorie nach DIN EN ISO 7730","Category DIN EN ISO 7730","Classe sélon DIN EN ISO 7730","Categoria secondo DIN EN ISO 7730","Categoria  DIN EN ISO 7730","Kategori DIN EN ISO 7730"]
[null,"Ermittlung der Raumabsorption im diffusen Schallfeld","Calculation of room sound absorption in the diffuse sound field","Calculation of room sound absorption in the diffuse sound field","Calcolazione di attenuazione sonora del locale","Cálculo da absorção de som pela sala num campo difuso de som","Ses yayilma alani oda ses yutumu hesabi "]
[null,"Raumabmessungen:","Room dimensions:","Room dimensions:","dimensioni ambiente","Dimensões da sala","Oda Boyutlari"]
[null,"Breite:","Width:","Width:","larghezza","Largura:","Genislik"]
[null,"Höhe:","Height:","Height:","altezza","Pé Direito:","Yukseklik"]
[null,"Tiefe:","Depth:","Depth:","profondità","Profundidade:","Derinlik"]
[null,"Gewählte Nachhallzeit:","Selected reverberation period:","Selected reverberation period:","Periodo di riverberazione considerato","Seleccionar o tempo de reverberação:","Secilen yankilanma suresi"]
[null,"Äquivalente Absorptionsfläche:","Equivalent absorption area:","Equivalent absorption area:","Area equivalente di assorbimento","Área de absorção equivalente","Esdeger absorbsiyon alani"]
[null,"Stutzenanzahl [Stck]","No. of spigots [pc]","No. of spigots [pc]","Numero attacchi aria ","Nº de golas de ligação","Yaka sayisi (ad)"]
[null,"Stutzendurchmesser [mm]","Spigot diameter [mm]","Spigot diameter [mm]","Diametro in mm","Diâmetro da gola de ligação [mm]","Yaka capi  (mm)"]
[null,"Drossel - Typ","Type of throttlling device","Type of throttlling device","Tipo di serranda di taratura","Tipo de registo","Damper tipi "]
[null,"Drossel - Einstellung","Throttling device adjustment","Throttling device adjustment","Taratura della serranda","Regulação do registo","Damper ayari"]
[null,"Max. zulässiger Schalldruckpegel im Raum","Sound pressure level limit in the room","Niveau pression sonore du local maximale","Pressione sonora massima risultante nel locale di progetto","Pressão sonora maxima, total, na sala","Oda ses basinci degeri limiti"]
[null,"Hotel:","Hotel:","Hotel:","Hotel:","Hotel:","Hotel"]
[null,"Zugluftrisiko","Draught risk","Risque vitesse trop elevé","Rischio spiffero","Risco de corrente de ar","Cereyan riski"]
[null,"Zulässige A-bewertete Schalldruckpegel. Standardwerte gemäß EN 13779.","Sound pressure level limits according to EN 13779 (atandard values):","Sound pressure level limits according to EN 13779 (atandard values):","Sound pressure level limits according to EN 13779 (atandard values):","Limites de pressão sonora de acordo com a EN 13779 (valores standard)","EN 13779   (standart degerler) e gore Ses basinci limiti "]
[null,"Bibliotheken:","Library:","Library:","Library:","Biblioteca","Kutuphane"]
[null,"Gerichtssaal:","Courtroom:","Courtroom:","Courtroom:","Sala de audiências","Adliye "]
[null,"Zimmer (Tag):","Room (Day):","Room (Day):","Room (Day):","Quarto (Dia)","Oda (gunduz)"]
[null,"Zimmer (Nacht):","Room (Night):","Room (Night):","Room (Night):","Quarto (Noite)","Oda (gece)"]
[null,"Beispiele üblicher Nachhallzeiten:","Examples for reverberation period values:","Examples for reverberation period values:","Examples for reverberation period values:","Examples for reverberation period values:","Ornek yankilanma suresi degeleri"]
[null,"Kühlleistung:","Cooling capacity:","Cooling capacity:","Cooling capacity:","apacicade de arrefecimento","Sogutma kapasitesi"]
[null,"Gewählten LDB Typ bearbeiten","Edit selected LDB type",null,null,"Mostrar modelo seleccionado","Secilen LDB tipini duzenle"]
[null,"Berechnungshilfe Raumabsoprtion","Calculation of room sound absorption ",null,null,"Cálculo do nível de ruído na sala","Oda ses yutumu hesabi"]
[null,"Zulässige Schalldruckpegel","Sound pressure level limits",null,null,"Limites de Pressão Sonora","Ses basinci seviyesi limiti"]
[null,"Zurück","Back",null,null,"Para trás","Geri "]
[null,"Zurück + Übernehmen","Back + Confirm",null,null,"Para trás + Confirme","Geri + Teyid"]
[null,"Abbrechen","Cancel",null,null,"Cancelar","İptal"]
[null,"Drehzahlstufe","Fan Speed Level",null,"Velocità del ventilatore "]
[null,"Drehzahlsteuerungeingangssignal 8V - 24V","Fan Speed Control Input Signal 8V - 24 V",null,"Input velocità ventilatore da 8 a 24 volts"]
[null,"Umluftvolumenstrom pro Gerät ","Recirculation Air Flow Rate per Unit",null,"Portata aria ricircolata "]
[null,"Schallleistung (Toleranz +/- 3 dB) - ","Sound Power Level (Tolerance +/- 3dB)",null,"Livello potenza sonora tolleranza +/- 3 dB "]
[null,"Schalldruckpegel bei 18 m² Sabine  (+/- 3 dB)","Sound Pressure Level (Tolerance +/- 3dB) at 18 m² Sabine Absorption Area",null,"Livello di pressione sonora (toll +/- 3 dB) con una superficie di assorbimento di 18 mq Sabine "]
[null,"sensible Kühlleistung,  nichtkondensierender Betrieb (im Kondensatbetrieb sind Abweichungen je nach Luftfeuchtigkeit möglich)","Sensible Cooling Capacity During Non-Condesating Operation  (Discrepances During Condensating Operation depending on air humidity)",null,"Resa sensibile raffreddamento (con discrepanze se in deumidificazione a secondo umidità dell'aria)  "]
[null,"Heizleistung","Heating Capacity ",null,"Resa in riscaldamento  "]
[null,"Kaltwasser-Rücklauftemperatur","Cold Water Return Temperature",null,"Temperatura ritorno acqua refrigerata   "]
[null,"Warmwasser-Rücklauftemperatur","Hot Water Return Temperature",null,"Temperatura ritorno acqua calda "]
[null,"Wassermenge Kühlen","Cold Water Flow Rate",null,"Portata acqua refrigerata"]
[null,"Wassermenge Heizen","Hot Water Flow Rate",null,"Portata acqua calda "]
[null,"wasserseitiger Druckverlust über Kühlregister","Waterside Pressure Drop over Cooling Coil ",null,"Perdita carico acqua batteria fredda"]
[null,"wasserseitiger Druckverlust über Heizregister ","Waterside Pressure Drop over Heating Coil ",null,"Perdita carico acqua nella batteria calda"]
[null,"Eigenkonvektion bei Warmwasservorlaufttemperatur 70 °C, Raumlufttemperatur 20 °C, Nennwassermenge","Natural Convection at Water Supply Temperatures 70 °C; Room Air Temperature of 20°C and Nominal Hot Water Flow ",null,"Resa a convezione naturale in riscaldamento con acqua a 70 °C aria a 20 °C e portata acqua nominale"]
[null,"elektrische Leistungsaufnahme","electrical Power Input",null,"Potenza elettrica assorbita"]
[null,"Kühlfall","Cooling Mode",null,"In raffescamento"]
[null,"Heizfall","Heating Mode",null,"In riscaldamento"]
[null,"Ansaugtemperatur","Intake Air Temperature",null,"Temperatura aria in ingresso "]
[null,"Wasservorlauftemperatur","Water Supply Temperature",null,"Temperatura acqua in ingresso  "]
[null,"Baugröße","Size",null,"Taglia"]
[null,"Nennwassermenge","Nominal Water Flow Rate",null,"Portata acqua nominale "]
[null,"Auswahl","Choice",null,"Scelta"]
[null,"Kühlen","Cooling",null,"Raffrescamento"]
[null,"Heizen ","Heating",null,"Riscaldamento"]
[null,"projektierte Leistung im Auslegungsfall ","Required Capacity For Design Situation",null,"Potenzialità richiesta di progetto"]