{"text_format":"1","workbook":"xlsx","n_sheets":4,"sheets":["HFVsf-_-4 - Kühlen","HFVsf-_-4 - Heizen","Hinterlegte Gleichungen","Legende"],"not_rendered":{"charts":21,"images":7,"macros":1,"external_links":3,"defined_names":187,"comments":0,"pivot_tables":0},"unopened":[],"bounds":{"document_bytes":16777216,"sheet_cells":100000,"rows_first":2000,"rows_last":500,"rows_between":2000,"halvings":0,"cell_chars":16384,"cell_head_chars":4096},"cells_cut":0,"cells_raw":0,"read":"whole","date_system":"1900"}

{"sheet":"HFVsf-_-4 - Kühlen","index":0,"n_rows":61,"n_cols":34,"rows_kept":61,"cut":false,"hidden":false,"merged":[[24,4,24,10],[24,13,24,19],[24,22,24,28],[40,2,47,3],[40,29,47,30],[31,4,31,5],[31,22,31,23],[31,13,31,14],[4,25,4,26],[5,25,5,27],[6,25,6,27],[7,25,7,27],[10,12,14,12],[18,4,18,5],[21,4,21,5],[22,4,22,5],[17,4,17,5],[9,4,9,5],[10,4,10,5],[12,4,12,5],[13,4,13,5],[14,4,14,5]]}
[null,"Tel.  +49 (0)711 8201-180   Fax: -720",null,null,null,null,null,null,null,null,null,null,null,null,null,null,null,null,null,null,null,null,null,null,null,"eMail:",null,null,null,"Raumluft@LTG-AG.de"]
[null,{"$f":"IF(Sprache=\"Deutsch\",VLOOKUP(\"Induktionsgerät HFVsf - System smart flow, 4-Leiter-System\",Legende!$B$3:$E$83,1,FALSE),IF(Sprache=\"English\",VLOOKUP(\"Induktionsgerät HFVsf - System smart flow, 4-Leiter-System\",Legende!$B$3:$E$83,2,FALSE),IF(Sprache=\"Francais\",VLOOKUP(\"Induktionsgerät HFVsf - System smart flow, 4-Leiter-System\",Legende!$B$3:$E$83,3,FALSE),0)))","v":"Induktionsgerät HFVsf - System smart flow, 4-Leiter-System"},null,null,null,null,null,null,null,null,null,null,null,null,null,null,null,null,null,null,null,{"$f":"IF(Sprache=\"Deutsch\",VLOOKUP(\"Sprache:\",Legende!$B$3:$E$83,1,FALSE),IF(Sprache=\"English\",VLOOKUP(\"Sprache:\",Legende!$B$3:$E$83,2,FALSE),IF(Sprache=\"Francais\",VLOOKUP(\"Sprache:\",Legende!$B$3:$E$83,3,FALSE),0)))","v":"Sprache:"},null,null,null,null,null,null,null,"LTG Aktiengesellschaft"]
[null,null,null,null,null,null,null,null,null,null,null,null,null,null,null,null,null,null,null,null,null,null,null,null,null,null,null,null,null,null,null,null,null,"Deutsch"]
[null,null,null,null,null,null,null,null,null,null,null,null,null,null,null,null,null,null,null,null,null,null,null,null,null,null,null,null,null,null,null,null,null,{"$f":"Legende!B5","v":"Deutsch"}]
[null,null,"Foto",null,null,null,"Foto",null,null,null,null,null,null,null,null,null,null,null,null,null,null,null,null,null,{"$f":"IF(Sprache=\"Deutsch\",VLOOKUP(\"Datum:\",Legende!$B$3:$E$83,1,FALSE),IF(Sprache=\"English\",VLOOKUP(\"Datum:\",Legende!$B$3:$E$83,2,FALSE),IF(Sprache=\"Francais\",VLOOKUP(\"Datum:\",Legende!$B$3:$E$83,3,FALSE),0)))","v":"Datum:"},{"$f":"TODAY()","v":"2026-06-23"},null,null,null,null,null,null,null,{"$f":"Legende!C5","v":"English"}]
[null,null,null,null,null,null,null,null,null,null,null,null,null,null,null,null,null,null,null,null,null,null,null,null,{"$f":"IF(Sprache=\"Deutsch\",VLOOKUP(\"Bearbeiter:\",Legende!$B$3:$E$83,1,FALSE),IF(Sprache=\"English\",VLOOKUP(\"Bearbeiter:\",Legende!$B$3:$E$83,2,FALSE),IF(Sprache=\"Francais\",VLOOKUP(\"Bearbeiter:\",Legende!$B$3:$E$83,3,FALSE),0)))","v":"Bearbeiter:"}]
[null,null,null,null,null,null,null,null,null,null,null,null,null,null,null,null,null,null,null,null,null,null,null,null,{"$f":"IF(Sprache=\"Deutsch\",VLOOKUP(\"Projekt:\",Legende!$B$3:$E$83,1,FALSE),IF(Sprache=\"English\",VLOOKUP(\"Projekt:\",Legende!$B$3:$E$83,2,FALSE),IF(Sprache=\"Francais\",VLOOKUP(\"Projekt:\",Legende!$B$3:$E$83,3,FALSE),0)))","v":"Projekt:"}]
[null,null,null,null,null,null,null,null,null,null,null,null,null,null,null,null,null,null,null,null,null,null,null,null,{"$f":"IF(Sprache=\"Deutsch\",VLOOKUP(\"Variante:\",Legende!$B$3:$E$83,1,FALSE),IF(Sprache=\"English\",VLOOKUP(\"Variante:\",Legende!$B$3:$E$83,2,FALSE),IF(Sprache=\"Francais\",VLOOKUP(\"Variante:\",Legende!$B$3:$E$83,3,FALSE),0)))","v":"Variante:"}]
[]
[null,{"$f":"IF(Sprache=\"Deutsch\",VLOOKUP(\"Auslegunsbedingungen:\",Legende!$B$3:$E$83,1,FALSE),IF(Sprache=\"English\",VLOOKUP(\"Auslegunsbedingungen:\",Legende!$B$3:$E$83,2,FALSE),IF(Sprache=\"Francais\",VLOOKUP(\"Auslegunsbedingungen:\",Legende!$B$3:$E$83,3,FALSE),0)))","v":"Auslegunsbedingungen:"},null,null,{"$f":"IF(Sprache=\"Deutsch\",VLOOKUP(\"Kühlen\",Legende!$B$3:$E$83,1,FALSE),IF(Sprache=\"English\",VLOOKUP(\"Kühlen\",Legende!$B$3:$E$83,2,FALSE),IF(Sprache=\"Francais\",VLOOKUP(\"Kühlen\",Legende!$B$3:$E$83,3,FALSE),0)))","v":"Kühlen"},null,null,null,{"$f":"IF(Sprache=\"Deutsch\",VLOOKUP(\"Bemerkungen:\",Legende!$B$3:$E$83,1,FALSE),IF(Sprache=\"English\",VLOOKUP(\"Bemerkungen:\",Legende!$B$3:$E$83,2,FALSE),IF(Sprache=\"Francais\",VLOOKUP(\"Bemerkungen:\",Legende!$B$3:$E$83,3,FALSE),0)))","v":"Bemerkungen:"},null,null,null,null,null,null,null,null,null,null,null,{"$f":"IF(Sprache=\"Deutsch\",VLOOKUP(\"Betriebszustände (Stellung Düsenklappe)\",Legende!$B$3:$E$83,1,FALSE),IF(Sprache=\"English\",VLOOKUP(\"Betriebszustände (Stellung Düsenklappe)\",Legende!$B$3:$E$83,2,FALSE),IF(Sprache=\"Francais\",VLOOKUP(\"Betriebszustände (Stellung Düsenklappe)\",Legende!$B$3:$E$83,3,FALSE),0)))","v":"Betriebszustände (Stellung Düsenklappe)"}]
[null,{"$f":"IF(Sprache=\"Deutsch\",VLOOKUP(\"Raumlufttemperatur\",Legende!$B$3:$E$83,1,FALSE),IF(Sprache=\"English\",VLOOKUP(\"Raumlufttemperatur\",Legende!$B$3:$E$83,2,FALSE),IF(Sprache=\"Francais\",VLOOKUP(\"Raumlufttemperatur\",Legende!$B$3:$E$83,3,FALSE),0)))","v":"Raumlufttemperatur"},null,null,26,null,null,null,{"$f":"IF(Sprache=\"Deutsch\",VLOOKUP(\" => Ablufttemperatur\",Legende!$B$3:$E$83,1,FALSE),IF(Sprache=\"English\",VLOOKUP(\" => Ablufttemperatur\",Legende!$B$3:$E$83,2,FALSE),IF(Sprache=\"Francais\",VLOOKUP(\" => Ablufttemperatur\",Legende!$B$3:$E$83,3,FALSE),0)))","v":" => Ablufttemperatur"},null,null,null,{"$f":"IF(Sprache=\"Deutsch\",VLOOKUP(\"Sekundärleistung\",Legende!$B$3:$E$83,1,FALSE),IF(Sprache=\"English\",VLOOKUP(\"Sekundärleistung\",Legende!$B$3:$E$83,2,FALSE),IF(Sprache=\"Francais\",VLOOKUP(\"Sekundärleistung\",Legende!$B$3:$E$83,3,FALSE),0)))","v":"Sekundärleistung"},null,null,null,null,null,null,null,{"$f":"IF(Sprache=\"Deutsch\",VLOOKUP(\"V0 - geschlossen\",Legende!$B$3:$E$83,1,FALSE),IF(Sprache=\"English\",VLOOKUP(\"V0 - geschlossen\",Legende!$B$3:$E$83,2,FALSE),IF(Sprache=\"Francais\",VLOOKUP(\"V0 - geschlossen\",Legende!$B$3:$E$83,3,FALSE),0)))","v":"V0 - geschlossen"}]
[null,null,null,null,null,null,null,null,null,null,null,null,null,null,null,null,null,null,null,null,{"$f":"IF(Sprache=\"Deutsch\",VLOOKUP(\"V1 - geringe Primärluftmenge 1, geringe Induktion\",Legende!$B$3:$E$83,1,FALSE),IF(Sprache=\"English\",VLOOKUP(\"V1 - geringe Primärluftmenge 1, geringe Induktion\",Legende!$B$3:$E$83,2,FALSE),IF(Sprache=\"Francais\",VLOOKUP(\"V1 - geringe Primärluftmenge 1, geringe Induktion\",Legende!$B$3:$E$83,3,FALSE),0)))","v":"V1 - geringe Primärluftmenge 1, geringe Induktion"}]
[null,{"$f":"IF(Sprache=\"Deutsch\",VLOOKUP(\"relative Feuchte\",Legende!$B$3:$E$83,1,FALSE),IF(Sprache=\"English\",VLOOKUP(\"relative Feuchte\",Legende!$B$3:$E$83,2,FALSE),IF(Sprache=\"Francais\",VLOOKUP(\"relative Feuchte\",Legende!$B$3:$E$83,3,FALSE),0)))","v":"relative Feuchte"},null,null,50,null,null,null,{"$f":"IF(Sprache=\"Deutsch\",VLOOKUP(\"Bereich:\",Legende!$B$3:$E$83,1,FALSE),IF(Sprache=\"English\",VLOOKUP(\"Bereich:\",Legende!$B$3:$E$83,2,FALSE),IF(Sprache=\"Francais\",VLOOKUP(\"Bereich:\",Legende!$B$3:$E$83,3,FALSE),0)))","v":"Bereich:"},null,"30-70 %",null,null,null,null,null,null,null,null,null,{"$f":"IF(Sprache=\"Deutsch\",VLOOKUP(\"V2 - geringe Primärluftmenge 2, mittlere Induktion\",Legende!$B$3:$E$83,1,FALSE),IF(Sprache=\"English\",VLOOKUP(\"V2 - geringe Primärluftmenge 2, mittlere Induktion\",Legende!$B$3:$E$83,2,FALSE),IF(Sprache=\"Francais\",VLOOKUP(\"V2 - geringe Primärluftmenge 2, mittlere Induktion\",Legende!$B$3:$E$83,3,FALSE),0)))","v":"V2 - geringe Primärluftmenge 2, mittlere Induktion"}]
[null,{"$f":"IF(Sprache=\"Deutsch\",VLOOKUP(\"Taupunkttemperatur Raumluft\",Legende!$B$3:$E$83,1,FALSE),IF(Sprache=\"English\",VLOOKUP(\"Taupunkttemperatur Raumluft\",Legende!$B$3:$E$83,2,FALSE),IF(Sprache=\"Francais\",VLOOKUP(\"Taupunkttemperatur Raumluft\",Legende!$B$3:$E$83,3,FALSE),0)))","v":"Taupunkttemperatur Raumluft"},null,null,{"$f":"(241.2*LN(E13/100)+4222.03716*E11/(241.2+E11))/(17.5043-LN(E11/100)-17.5043*G18/(241.2+G18))","v":12.924250177222383},null,null,null,null,null,null,null,null,null,null,null,null,null,null,null,{"$f":"IF(Sprache=\"Deutsch\",VLOOKUP(\"V3 - mittlere Primärluftmenge 1, mittlere Induktion\",Legende!$B$3:$E$83,1,FALSE),IF(Sprache=\"English\",VLOOKUP(\"V3 - mittlere Primärluftmenge 1, mittlere Induktion\",Legende!$B$3:$E$83,2,FALSE),IF(Sprache=\"Francais\",VLOOKUP(\"V3 - mittlere Primärluftmenge 1, mittlere Induktion\",Legende!$B$3:$E$83,3,FALSE),0)))","v":"V3 - mittlere Primärluftmenge 1, mittlere Induktion"}]
[null,{"$f":"IF(Sprache=\"Deutsch\",VLOOKUP(\"Wassergehalt Raumluft\",Legende!$B$3:$E$83,1,FALSE),IF(Sprache=\"English\",VLOOKUP(\"Wassergehalt Raumluft\",Legende!$B$3:$E$83,2,FALSE),IF(Sprache=\"Francais\",VLOOKUP(\"Wassergehalt Raumluft\",Legende!$B$3:$E$83,3,FALSE),0)))","v":"Wassergehalt Raumluft"},null,null,{"$f":"(E13/100)*(0.0357*E11^2-0.4941*E11+10.356)","v":10.821300000000001},null,null,null,null,null,null,null,null,null,null,null,null,null,null,null,{"$f":"IF(Sprache=\"Deutsch\",VLOOKUP(\"V4 – mittlere Primärluftmenge 2,  mittlere Induktion\",Legende!$B$3:$E$83,1,FALSE),IF(Sprache=\"English\",VLOOKUP(\"V4 – mittlere Primärluftmenge 2,  mittlere Induktion\",Legende!$B$3:$E$83,2,FALSE),IF(Sprache=\"Francais\",VLOOKUP(\"V4 – mittlere Primärluftmenge 2,  mittlere Induktion\",Legende!$B$3:$E$83,3,FALSE),0)))","v":"V4 – mittlere Primärluftmenge 2,  mittlere Induktion"}]
[null,null,null,null,null,null,null,null,null,null,null,null,null,null,null,null,null,null,null,null,{"$f":"IF(Sprache=\"Deutsch\",VLOOKUP(\"V5 - Booststufe 1, hohe Induktion\",Legende!$B$3:$E$83,1,FALSE),IF(Sprache=\"English\",VLOOKUP(\"V5 - Booststufe 1, hohe Induktion\",Legende!$B$3:$E$83,2,FALSE),IF(Sprache=\"Francais\",VLOOKUP(\"V5 - Booststufe 1, hohe Induktion\",Legende!$B$3:$E$83,3,FALSE),0)))","v":"V5 - Booststufe 1, hohe Induktion"}]
[null,{"$f":"IF(Sprache=\"Deutsch\",VLOOKUP(\"Primärseite (Luftseite):\",Legende!$B$3:$E$83,1,FALSE),IF(Sprache=\"English\",VLOOKUP(\"Primärseite (Luftseite):\",Legende!$B$3:$E$83,2,FALSE),IF(Sprache=\"Francais\",VLOOKUP(\"Primärseite (Luftseite):\",Legende!$B$3:$E$83,3,FALSE),0)))","v":"Primärseite (Luftseite):"},null,null,null,null,null,null,null,null,null,null,null,null,null,null,null,null,null,null,{"$f":"IF(Sprache=\"Deutsch\",VLOOKUP(\"V6 - Booststufe 2, hohe Induktion\",Legende!$B$3:$E$83,1,FALSE),IF(Sprache=\"English\",VLOOKUP(\"V6 - Booststufe 2, hohe Induktion\",Legende!$B$3:$E$83,2,FALSE),IF(Sprache=\"Francais\",VLOOKUP(\"V6 - Booststufe 2, hohe Induktion\",Legende!$B$3:$E$83,3,FALSE),0)))","v":"V6 - Booststufe 2, hohe Induktion"}]
[null,{"$f":"IF(Sprache=\"Deutsch\",VLOOKUP(\"Primärdruck\",Legende!$B$3:$E$83,1,FALSE),IF(Sprache=\"English\",VLOOKUP(\"Primärdruck\",Legende!$B$3:$E$83,2,FALSE),IF(Sprache=\"Francais\",VLOOKUP(\"Primärdruck\",Legende!$B$3:$E$83,3,FALSE),0)))","v":"Primärdruck"},null,null,100,null,null,null,{"$f":"IF(Sprache=\"Deutsch\",VLOOKUP(\"Bereich:\",Legende!$B$3:$E$83,1,FALSE),IF(Sprache=\"English\",VLOOKUP(\"Bereich:\",Legende!$B$3:$E$83,2,FALSE),IF(Sprache=\"Francais\",VLOOKUP(\"Bereich:\",Legende!$B$3:$E$83,3,FALSE),0)))","v":"Bereich:"},null,"50 - 150 Pa"]
[null,{"$f":"IF(Sprache=\"Deutsch\",VLOOKUP(\"Primärlufttemperatur\",Legende!$B$3:$E$83,1,FALSE),IF(Sprache=\"English\",VLOOKUP(\"Primärlufttemperatur\",Legende!$B$3:$E$83,2,FALSE),IF(Sprache=\"Francais\",VLOOKUP(\"Primärlufttemperatur\",Legende!$B$3:$E$83,3,FALSE),0)))","v":"Primärlufttemperatur"},null,null,19,null,null,null,{"$f":"IF(Sprache=\"Deutsch\",VLOOKUP(\"Bereich:\",Legende!$B$3:$E$83,1,FALSE),IF(Sprache=\"English\",VLOOKUP(\"Bereich:\",Legende!$B$3:$E$83,2,FALSE),IF(Sprache=\"Francais\",VLOOKUP(\"Bereich:\",Legende!$B$3:$E$83,3,FALSE),0)))","v":"Bereich:"},null,"18 - 30 °C"]
[]
{"$rows_left_out":42}
{"sheet":"HFVsf-_-4 - Heizen","index":1,"n_rows":58,"n_cols":30,"rows_kept":58,"cut":false,"hidden":false,"merged":[[37,2,44,3],[37,29,44,30],[20,22,20,28],[28,4,28,5],[28,13,28,14],[28,22,28,23],[20,4,20,10],[20,13,20,19],[4,25,4,26],[5,25,5,27],[6,25,6,27],[7,25,7,27],[9,4,9,5],[13,4,13,5],[14,4,14,5],[17,4,17,5],[18,4,18,5],[10,4,10,5]]}
[null,"Tel.  +49 (0)711 8201-180   Fax: -720",null,null,null,null,null,null,null,null,null,null,null,null,null,null,null,null,null,null,null,null,null,null,null,"eMail:",null,null,null,"Raumluft@LTG-AG.de"]
[null,{"$f":"IF(Sprache=\"Deutsch\",VLOOKUP(\"Induktionsgerät HFVsf - System smart flow, 4-Leiter-System\",Legende!$B$3:$E$83,1,FALSE),IF(Sprache=\"English\",VLOOKUP(\"Induktionsgerät HFVsf - System smart flow, 4-Leiter-System\",Legende!$B$3:$E$83,2,FALSE),IF(Sprache=\"Francais\",VLOOKUP(\"Induktionsgerät HFVsf - System smart flow, 4-Leiter-System\",Legende!$B$3:$E$83,3,FALSE),0)))","v":"Induktionsgerät HFVsf - System smart flow, 4-Leiter-System"},null,null,null,null,null,null,null,null,null,null,null,null,null,null,null,null,null,null,null,{"$f":"IF(Sprache=\"Deutsch\",VLOOKUP(\"Sprache:\",Legende!$B$3:$E$83,1,FALSE),IF(Sprache=\"English\",VLOOKUP(\"Sprache:\",Legende!$B$3:$E$83,2,FALSE),IF(Sprache=\"Francais\",VLOOKUP(\"Sprache:\",Legende!$B$3:$E$83,3,FALSE),0)))","v":"Sprache:"},{"$f":"Sprache","v":"Deutsch"},null,null,null,null,null,null,"LTG Aktiengesellschaft"]
[]
[]
[null,null,null,null,null,null,null,null,null,null,null,null,null,null,null,null,null,null,null,null,null,null,null,null,{"$f":"IF(Sprache=\"Deutsch\",VLOOKUP(\"Datum:\",Legende!$B$3:$E$83,1,FALSE),IF(Sprache=\"English\",VLOOKUP(\"Datum:\",Legende!$B$3:$E$83,2,FALSE),IF(Sprache=\"Francais\",VLOOKUP(\"Datum:\",Legende!$B$3:$E$83,3,FALSE),0)))","v":"Datum:"},{"$f":"TODAY()","v":"2026-06-23"}]
[null,null,null,null,null,null,null,null,null,null,null,null,null,null,null,null,null,null,null,null,null,null,null,null,{"$f":"IF(Sprache=\"Deutsch\",VLOOKUP(\"Bearbeiter:\",Legende!$B$3:$E$83,1,FALSE),IF(Sprache=\"English\",VLOOKUP(\"Bearbeiter:\",Legende!$B$3:$E$83,2,FALSE),IF(Sprache=\"Francais\",VLOOKUP(\"Bearbeiter:\",Legende!$B$3:$E$83,3,FALSE),0)))","v":"Bearbeiter:"}]
[null,null,null,null,null,null,null,null,null,null,null,null,null,null,null,null,null,null,null,null,null,null,null,null,{"$f":"IF(Sprache=\"Deutsch\",VLOOKUP(\"Projekt:\",Legende!$B$3:$E$83,1,FALSE),IF(Sprache=\"English\",VLOOKUP(\"Projekt:\",Legende!$B$3:$E$83,2,FALSE),IF(Sprache=\"Francais\",VLOOKUP(\"Projekt:\",Legende!$B$3:$E$83,3,FALSE),0)))","v":"Projekt:"}]
[null,null,null,null,null,null,null,null,null,null,null,null,null,null,null,null,null,null,null,null,null,null,null,null,{"$f":"IF(Sprache=\"Deutsch\",VLOOKUP(\"Variante:\",Legende!$B$3:$E$83,1,FALSE),IF(Sprache=\"English\",VLOOKUP(\"Variante:\",Legende!$B$3:$E$83,2,FALSE),IF(Sprache=\"Francais\",VLOOKUP(\"Variante:\",Legende!$B$3:$E$83,3,FALSE),0)))","v":"Variante:"}]
[]
[null,{"$f":"IF(Sprache=\"Deutsch\",VLOOKUP(\"Auslegunsbedingungen:\",Legende!$B$3:$E$83,1,FALSE),IF(Sprache=\"English\",VLOOKUP(\"Auslegunsbedingungen:\",Legende!$B$3:$E$83,2,FALSE),IF(Sprache=\"Francais\",VLOOKUP(\"Auslegunsbedingungen:\",Legende!$B$3:$E$83,3,FALSE),0)))","v":"Auslegunsbedingungen:"},null,null,{"$f":"IF(Sprache=\"Deutsch\",VLOOKUP(\"Heizen\",Legende!$B$3:$E$83,1,FALSE),IF(Sprache=\"English\",VLOOKUP(\"Heizen\",Legende!$B$3:$E$83,2,FALSE),IF(Sprache=\"Francais\",VLOOKUP(\"Heizen\",Legende!$B$3:$E$83,3,FALSE),0)))","v":"Heizen"},null,null,null,{"$f":"IF(Sprache=\"Deutsch\",VLOOKUP(\"Bemerkungen:\",Legende!$B$3:$E$83,1,FALSE),IF(Sprache=\"English\",VLOOKUP(\"Bemerkungen:\",Legende!$B$3:$E$83,2,FALSE),IF(Sprache=\"Francais\",VLOOKUP(\"Bemerkungen:\",Legende!$B$3:$E$83,3,FALSE),0)))","v":"Bemerkungen:"}]
[null,{"$f":"IF(Sprache=\"Deutsch\",VLOOKUP(\"Raumlufttemperatur\",Legende!$B$3:$E$83,1,FALSE),IF(Sprache=\"English\",VLOOKUP(\"Raumlufttemperatur\",Legende!$B$3:$E$83,2,FALSE),IF(Sprache=\"Francais\",VLOOKUP(\"Raumlufttemperatur\",Legende!$B$3:$E$83,3,FALSE),0)))","v":"Raumlufttemperatur"},null,null,22,null,null,null,{"$f":"IF(Sprache=\"Deutsch\",VLOOKUP(\" => Ablufttemperatur\",Legende!$B$3:$E$83,1,FALSE),IF(Sprache=\"English\",VLOOKUP(\" => Ablufttemperatur\",Legende!$B$3:$E$83,2,FALSE),IF(Sprache=\"Francais\",VLOOKUP(\" => Ablufttemperatur\",Legende!$B$3:$E$83,3,FALSE),0)))","v":" => Ablufttemperatur"}]
[]
[null,{"$f":"IF(Sprache=\"Deutsch\",VLOOKUP(\"Primärseite (Luftseite):\",Legende!$B$3:$E$83,1,FALSE),IF(Sprache=\"English\",VLOOKUP(\"Primärseite (Luftseite):\",Legende!$B$3:$E$83,2,FALSE),IF(Sprache=\"Francais\",VLOOKUP(\"Primärseite (Luftseite):\",Legende!$B$3:$E$83,3,FALSE),0)))","v":"Primärseite (Luftseite):"}]
[null,{"$f":"IF(Sprache=\"Deutsch\",VLOOKUP(\"Primärdruck\",Legende!$B$3:$E$83,1,FALSE),IF(Sprache=\"English\",VLOOKUP(\"Primärdruck\",Legende!$B$3:$E$83,2,FALSE),IF(Sprache=\"Francais\",VLOOKUP(\"Primärdruck\",Legende!$B$3:$E$83,3,FALSE),0)))","v":"Primärdruck"},null,null,100,null,null,null,{"$f":"IF(Sprache=\"Deutsch\",VLOOKUP(\"Bereich:\",Legende!$B$3:$E$83,1,FALSE),IF(Sprache=\"English\",VLOOKUP(\"Bereich:\",Legende!$B$3:$E$83,2,FALSE),IF(Sprache=\"Francais\",VLOOKUP(\"Bereich:\",Legende!$B$3:$E$83,3,FALSE),0)))","v":"Bereich:"},null,"50 - 150 Pa"]
[null,{"$f":"IF(Sprache=\"Deutsch\",VLOOKUP(\"Primärlufttemperatur\",Legende!$B$3:$E$83,1,FALSE),IF(Sprache=\"English\",VLOOKUP(\"Primärlufttemperatur\",Legende!$B$3:$E$83,2,FALSE),IF(Sprache=\"Francais\",VLOOKUP(\"Primärlufttemperatur\",Legende!$B$3:$E$83,3,FALSE),0)))","v":"Primärlufttemperatur"},null,null,18,null,null,null,{"$f":"IF(Sprache=\"Deutsch\",VLOOKUP(\"Bereich:\",Legende!$B$3:$E$83,1,FALSE),IF(Sprache=\"English\",VLOOKUP(\"Bereich:\",Legende!$B$3:$E$83,2,FALSE),IF(Sprache=\"Francais\",VLOOKUP(\"Bereich:\",Legende!$B$3:$E$83,3,FALSE),0)))","v":"Bereich:"},null,"18 - 30 °C"]
[]
[null,{"$f":"IF(Sprache=\"Deutsch\",VLOOKUP(\"Sekundärseite (Wasserseite):\",Legende!$B$3:$E$83,1,FALSE),IF(Sprache=\"English\",VLOOKUP(\"Sekundärseite (Wasserseite):\",Legende!$B$3:$E$83,2,FALSE),IF(Sprache=\"Francais\",VLOOKUP(\"Sekundärseite (Wasserseite):\",Legende!$B$3:$E$83,3,FALSE),0)))","v":"Sekundärseite (Wasserseite):"}]
[null,{"$f":"IF(Sprache=\"Deutsch\",VLOOKUP(\"Wasservorlauftemperatur\",Legende!$B$3:$E$83,1,FALSE),IF(Sprache=\"English\",VLOOKUP(\"Wasservorlauftemperatur\",Legende!$B$3:$E$83,2,FALSE),IF(Sprache=\"Francais\",VLOOKUP(\"Wasservorlauftemperatur\",Legende!$B$3:$E$83,3,FALSE),0)))","v":"Wasservorlauftemperatur"},null,null,55,null,null,null,{"$f":"IF(Sprache=\"Deutsch\",VLOOKUP(\"Bereich:\",Legende!$B$3:$E$83,1,FALSE),IF(Sprache=\"English\",VLOOKUP(\"Bereich:\",Legende!$B$3:$E$83,2,FALSE),IF(Sprache=\"Francais\",VLOOKUP(\"Bereich:\",Legende!$B$3:$E$83,3,FALSE),0)))","v":"Bereich:"},null,"30 - 60 °C"]
[null,{"$f":"IF(Sprache=\"Deutsch\",VLOOKUP(\"Wassermassenstrom\",Legende!$B$3:$E$83,1,FALSE),IF(Sprache=\"English\",VLOOKUP(\"Wassermassenstrom\",Legende!$B$3:$E$83,2,FALSE),IF(Sprache=\"Francais\",VLOOKUP(\"Wassermassenstrom\",Legende!$B$3:$E$83,3,FALSE),0)))","v":"Wassermassenstrom"},null,null,100,null,null,null,{"$f":"IF(Sprache=\"Deutsch\",VLOOKUP(\"Bereich:\",Legende!$B$3:$E$83,1,FALSE),IF(Sprache=\"English\",VLOOKUP(\"Bereich:\",Legende!$B$3:$E$83,2,FALSE),IF(Sprache=\"Francais\",VLOOKUP(\"Bereich:\",Legende!$B$3:$E$83,3,FALSE),0)))","v":"Bereich:"},null,"10 - 160 kg/h"]
[]
{"$rows_left_out":39}
{"sheet":"Hinterlegte Gleichungen","index":2,"n_rows":150,"n_cols":63,"rows_kept":150,"cut":false,"hidden":true,"merged":[[6,5,8,8],[6,15,8,18],[90,1,90,3],[90,4,90,6],[90,7,90,9],[90,10,90,12],[90,13,90,15],[90,16,90,18],[82,16,82,18],[83,1,83,3],[74,1,74,3],[74,4,74,6],[74,7,74,9],[74,10,74,12],[74,13,74,15],[91,1,91,3],[91,4,91,6],[91,7,91,9],[91,10,91,12],[91,13,91,15],[82,1,82,3],[82,4,82,6],[82,7,82,9],[82,10,82,12],[82,13,82,15],[75,1,75,3],[75,4,75,6],[75,7,75,9],[75,10,75,12],[75,13,75,15],[83,4,83,6],[83,7,83,9],[83,10,83,12],[83,13,83,15],[10,27,10,29],[101,16,101,18],[102,16,102,18],[109,16,109,18],[75,16,75,18],[83,16,83,18],[84,13,84,15],[84,16,84,18],[74,16,74,18],[102,13,102,15],[85,16,85,18],[86,13,86,15],[86,16,86,18],[91,16,91,18],[87,13,87,15],[87,16,87,18],[110,16,110,18],[117,16,117,18],[118,16,118,18],[112,16,112,18],[111,16,111,18],[113,16,113,18],[114,16,114,18],[109,13,109,15],[101,13,101,15],[110,7,110,9],[110,13,110,15],[117,13,117,15],[118,13,118,15],[111,13,111,15],[112,13,112,15],[113,13,113,15],[114,13,114,15],[85,13,85,15],[117,1,117,3],[118,1,118,3],[117,4,117,6],[117,7,117,9],[118,4,118,6],[128,7,128,9],[102,10,102,12],[109,10,109,12],[101,10,101,12],[101,1,101,3],[102,1,102,3],[101,4,101,6],[102,4,102,6],[101,7,101,9],[102,7,102,9],[117,10,117,12],[118,10,118,12],[118,7,118,9],[110,10,110,12],[109,1,109,3],[109,4,109,6],[109,7,109,9],[110,1,110,3],[110,4,110,6],[128,10,128,12],[138,13,138,15],[138,16,138,18],[139,13,139,15],[139,16,139,18],[128,13,128,15],[128,16,128,18],[129,1,129,3],[129,4,129,6],[129,7,129,9],[129,10,129,12],[129,13,129,15],[129,16,129,18],[128,1,128,3],[128,4,128,6],[145,16,145,18],[145,1,145,3],[145,4,145,6],[145,7,145,9],[145,10,145,12],[145,13,145,15],[140,13,140,15],[140,16,140,18],[136,16,136,18],[137,1,137,3],[137,4,137,6],[137,7,137,9],[137,10,137,12],[137,13,137,15],[137,16,137,18],[136,1,136,3],[141,13,141,15],[141,16,141,18],[144,1,144,3],[144,4,144,6],[144,7,144,9],[144,10,144,12],[144,13,144,15],[144,16,144,18],[136,4,136,6],[136,7,136,9],[136,10,136,12],[136,13,136,15]]}
["Auslegeprogramm  und Technische Daten HFVsf 4 / BG 630, 800 und 1000 / M2 / MQ oder MQQ"]
["CER/ND - Stand 02-2012"]
[]
[null,"Kühlen",null,null,"Einstellbereich:",null,null,null,null,null,null,"Heizen",null,null,"Einstellbereich:"]
[null,"Primärdruck",{"$f":"'HFVsf-_-4 - Kühlen'!E18","v":100},"Pa","50...150",null,null,null,null,null,null,"Primärdruck",{"$f":"'HFVsf-_-4 - Heizen'!E14","v":100},"Pa","50...150"]
[{"$f":"'HFVsf-_-4 - Kühlen'!E23*100/120","v":100},"wk",{"$f":"'HFVsf-_-4 - Kühlen'!E23","v":120},"kg/h","30...300",null,null,null,null,null,{"$f":"'HFVsf-_-4 - Heizen'!E19*100/100","v":100},"wh",{"$f":"'HFVsf-_-4 - Heizen'!E19","v":100},"kg/h","10...160"]
[null,"T_VL",{"$f":"'HFVsf-_-4 - Kühlen'!E22","v":16},"°C","?","Achtung! Die Primärlufttemperatur soll nicht 18°C unterschreiten",null,null,null,null,null,"T_VL",{"$f":"'HFVsf-_-4 - Heizen'!E18","v":55},"°C","30...60","Achtung! die Primärlufttemperatur soll nicht 18°C unterschreiten"]
[null,"T_Raum",{"$f":"'HFVsf-_-4 - Kühlen'!E11","v":26},"°C","?",null,null,null,null,null,{"$f":"'HFVsf-_-4 - Heizen'!E18-'HFVsf-_-4 - Heizen'!E11","v":33},"T_Raum",{"$f":"'HFVsf-_-4 - Heizen'!E11","v":22},"°C","?"]
[null,"T_Primärluft",{"$f":"'HFVsf-_-4 - Kühlen'!E19","v":19},"°C","18...30",null,null,null,null,null,null,"T_Primärluft",{"$f":"'HFVsf-_-4 - Heizen'!E15","v":18},"°C","18...30"]
[]
[]
[]
[]
[]
[]
[]
[]
[]
[]
[]
{"$rows_left_out":131}
{"sheet":"Legende","index":3,"n_rows":176,"n_cols":22,"rows_kept":176,"cut":false,"hidden":true,"merged":[]}
[null,null,null,null,null,null,"Tel.  +49 (0)711 8201-180   Fax -720"]
["LTG Aktiengesellschaft"]
[null,null,null,null,null,null,null,null,null,null,null,null,null,null,null,null,null,null,null,null,null,"Deutsch"]
[]
[null,"Deutsch","English","Francais","Italiano","Portugues","Turkish"]
[null,"Legende für LTG Auslegungstabellen","Legend for LTG Selection Sheets",null,"Legenda per le tabelle prestazioni di LTG "]
["x","Sprache:","Language:","Langue:","Lingua","Idioma:","Lisan"]
["x","Datum:","Date:","Data:","Data","Data:","Tarih"]
["x","Bearbeiter:","Editor:","Responsable:","Responsabile","Responsável:","Hazirlayan"]
["x","Projekt:","Project:","Projet:","Progetto","Projecto:","Proje"]
["x","Variante:","Alternative:","Variante:","Variante","Variante:","Alternatif"]
[null,"LTG Schlitzdurchlässe Typ LDB und LDB System Clean","LTG Linear Diffusers Type LDB and LDB System Clean","LTG Diffuseurs linéaires type LDB et LDB Système CLEAN","Diffusori lineari LTG tipo LDB e LDB System clean","Difusores lineares LTG, LDB e LDB System Clean ","LTG Lineer Slot Difüzör Tip LDB ve LDB Temiz Sistem "]
["x","Induktionsgerät HFVsf - System smart flow, 4-Leiter-System","LTG Induction Unit Type HFVsf - System smart flow, 4-pipe system - cooling and heating"]
["x","relative Feuchte","Relative room air humidity",null,"Umiditá relativa dell' area ambiente","Umidade relativa do ar na sala:"]
["x","Auslegunsbedingungen:","Room Conditions:","Donées du Local:","Condizioni:","Condicoes:"]
["x","Taupunkttemperatur Raumluft","Dew point temperatur of room air",null,"Temperature del punto di rugiada area ambiente","Ponto der condensacao"]
["x","Wassergehalt Raumluft","Humidity ration of room air",null,"Umiditá especifica dell' area ambiente","Umidade specífica do ar na sala:"]
["x"," => Ablufttemperatur"," => Extract air temperature",null," => Temperature dell' area estratta"]
["x","Bemerkungen:","Notes:",null,"Note:"]
["x","Primärseite (Luftseite):","Primary Side (Air side):"]
{"$rows_left_out":156}