{"text_format":"1","workbook":"xlsx","n_sheets":3,"sheets":["HFG","Legende - Legend","Tabelle1"],"not_rendered":{"charts":0,"images":48,"macros":1,"external_links":1,"defined_names":32,"comments":1,"pivot_tables":0},"unopened":[],"bounds":{"document_bytes":16777216,"sheet_cells":100000,"rows_first":2000,"rows_last":500,"rows_between":2000,"halvings":0,"cell_chars":16384,"cell_head_chars":4096},"cells_cut":0,"cells_raw":0,"read":"whole","date_system":"1900"}

{"sheet":"HFG","index":0,"n_rows":80,"n_cols":93,"rows_kept":80,"cut":false,"hidden":false,"merged":[[71,78,71,79],[71,80,71,89],[71,33,71,43],[0,85,0,89],[7,81,7,89],[8,81,8,89],[10,81,10,83],[11,81,11,85],[66,80,66,89],[67,80,67,89],[68,80,68,89],[66,78,66,79],[67,78,67,79],[68,78,68,79],[70,80,70,89],[69,78,69,79],[70,78,70,79],[69,31,69,32],[70,31,70,32],[69,33,69,43],[70,33,70,43],[31,27,32,27],[43,27,44,27],[66,31,66,32],[67,31,67,32],[68,31,68,32],[72,31,72,32],[72,33,72,43],[72,78,72,79],[72,80,72,89],[30,31,30,45],[42,31,42,45],[58,31,58,45],[30,77,30,91],[42,77,42,91],[45,47,45,48],[59,47,59,48],[66,33,66,43],[67,33,67,43],[68,33,68,43],[71,31,71,32],[69,80,69,89]]}
[null,null,null,null,null,null,null,null,null,null,null,null,null,null,null,null,null,null,null,null,null,null,null,null,null,null,null,null,null,null,null,"Tel.  +49 (0)711 8201-180",null,null,null,"Fax: -720",null,null,null,null,null,null,null,null,null,null,null,null,null,null,null,null,null,null,null,null,null,null,null,null,null,null,null,null,null,null,null,null,null,null,null,null,null,null,null,null,null,null,null,null,null,null,null,"Email:",null,"info@ltg-ag.de"]
[null,null,null,null,null,null,null,null,null,null,null,null,null,null,null,null,null,null,null,null,null,null,null,null,null,null,null,null,null,null,null,{"$f":"VLOOKUP(\"LTG Induktionsgerät HFG\",'Legende - Legend'!$B$5:$E$64,IF(Sprache=\"Deutsch\",1,IF(Sprache=\"English\",2,IF(Sprache=\"Francais\",3,IF(Sprache=\"Italiano\",4,IF(Sprache=\"Portugues\",5,6))))),FALSE)","v":"LTG Induktionsgerät HFG"},null,null,null,null,null,null,null,null,null,null,null,null,null,null,null,null,null,null,null,null,null,null,null,null,null,null,null,null,null,null,null,null,null,null,null,null,null,null,null,null,null,null,null,null,null,null,null,null,null,null,null,null,null,null,null,null,null,"LTG Aktiengesellschaft"]
[null,null,null,null,null,null,null,null,null,null,null,null,null,null,null,null,null,null,null,null,null,null,null,null,null,null,null,null,null,null,null,null,null,null,null,{"$f":"VLOOKUP(\"Filter\",'Legende - Legend'!$B$5:$E$64,IF(Sprache=\"Deutsch\",1,IF(Sprache=\"English\",2,IF(Sprache=\"Francais\",3,IF(Sprache=\"Italiano\",4,IF(Sprache=\"Portugues\",5,6))))),FALSE)","v":"Filter"}]
[null,null,null,null,null,null,null,null,null,null,null,null,null,null,null,null,null,null,null,null,null,null,null,null,null,null,null,null,null,null,null,null,null,null,null,{"$f":"VLOOKUP(\"Düsenvariante\",'Legende - Legend'!$B$5:$E$64,IF(Sprache=\"Deutsch\",1,IF(Sprache=\"English\",2,IF(Sprache=\"Francais\",3,IF(Sprache=\"Italiano\",4,IF(Sprache=\"Portugues\",5,6))))),FALSE)","v":"Düsenvariante"}]
[null,null,null,null,null,null,null,null,null,null,null,null,null,null,null,null,null,null,null,null,null,null,null,null,null,null,null,null,null,null,null,null,null,null,null,{"$f":"VLOOKUP(\"Wärmetauscher\",'Legende - Legend'!$B$5:$E$64,IF(Sprache=\"Deutsch\",1,IF(Sprache=\"English\",2,IF(Sprache=\"Francais\",3,IF(Sprache=\"Italiano\",4,IF(Sprache=\"Portugues\",5,6))))),FALSE)","v":"Wärmetauscher"}]
[null,null,null,null,null,null,null,null,null,null,null,null,null,null,null,null,null,null,null,null,null,null,null,null,null,null,null,null,null,null,null,null,null,{"$f":"VLOOKUP(\"Kühlfall\",'Legende - Legend'!$B$5:$E$64,IF(Sprache=\"Deutsch\",1,IF(Sprache=\"English\",2,IF(Sprache=\"Francais\",3,IF(Sprache=\"Italiano\",4,IF(Sprache=\"Portugues\",5,6))))),FALSE)","v":"Kühlfall"},null,null,null,null,null,null,{"$f":"VLOOKUP(\"Heizfall\",'Legende - Legend'!$B$5:$E$64,IF(Sprache=\"Deutsch\",1,IF(Sprache=\"English\",2,IF(Sprache=\"Francais\",3,IF(Sprache=\"Italiano\",4,IF(Sprache=\"Portugues\",5,6))))),FALSE)","v":"Heizfall"}]
[null,null,null,null,null,null,null,null,null,null,null,null,null,null,null,null,null,null,null,null,null,null,null,null,null,null,null,null,null,null,null,null,null,null,null,{"$f":"VLOOKUP(\"Ansaugtemperatur\",'Legende - Legend'!$B$5:$E$64,IF(Sprache=\"Deutsch\",1,IF(Sprache=\"English\",2,IF(Sprache=\"Francais\",3,IF(Sprache=\"Italiano\",4,IF(Sprache=\"Portugues\",5,6))))),FALSE)","v":"Ansaugtemperatur"},26,null,"°C",null,null,null,{"$f":"VLOOKUP(\"Ansaugtemperatur\",'Legende - Legend'!$B$5:$E$64,IF(Sprache=\"Deutsch\",1,IF(Sprache=\"English\",2,IF(Sprache=\"Francais\",3,IF(Sprache=\"Italiano\",4,IF(Sprache=\"Portugues\",5,6))))),FALSE)","v":"Ansaugtemperatur"},22,"°C",null,null,null,null,null,null,null,null,null,null,null,null,null,null,null,null,null,null,null,null,null,null,null,null,null,null,null,null,null,null,null,null,null,null,null,null,null,null,null,null,null,null,null,null,null,null,null,"Deutsch"]
[null,null,null,null,null,null,null,null,null,null,null,null,null,null,null,null,null,null,null,null,null,null,null,null,null,null,null,null,null,null,null,null,null,null,null,{"$f":"VLOOKUP(\"Primärlufttemperatur\",'Legende - Legend'!$B$5:$E$64,IF(Sprache=\"Deutsch\",1,IF(Sprache=\"English\",2,IF(Sprache=\"Francais\",3,IF(Sprache=\"Italiano\",4,IF(Sprache=\"Portugues\",5,6))))),FALSE)","v":"Primärlufttemperatur"},16,null,"°C",null,null,null,{"$f":"VLOOKUP(\"Primärlufttemperatur\",'Legende - Legend'!$B$5:$E$64,IF(Sprache=\"Deutsch\",1,IF(Sprache=\"English\",2,IF(Sprache=\"Francais\",3,IF(Sprache=\"Italiano\",4,IF(Sprache=\"Portugues\",5,6))))),FALSE)","v":"Primärlufttemperatur"},18,"°C",null,null,null,null,null,null,null,null,null,null,null,null,null,null,null,null,null,null,null,null,null,null,null,null,null,null,null,null,null,null,null,null,null,null,null,"Project:"]
[null,null,null,null,null,null,null,null,null,null,null,null,null,null,null,null,null,null,null,null,null,null,null,null,null,null,null,null,null,null,null,null,null,null,null,{"$f":"VLOOKUP(\"Primärluftvolumenstrom\",'Legende - Legend'!$B$5:$E$64,IF(Sprache=\"Deutsch\",1,IF(Sprache=\"English\",2,IF(Sprache=\"Francais\",3,IF(Sprache=\"Italiano\",4,IF(Sprache=\"Portugues\",5,6))))),FALSE)","v":"Primärluftvolumenstrom"},67,null,"m^3/h",null,null,null,{"$f":"VLOOKUP(\"Primärluftvolumenstrom\",'Legende - Legend'!$B$5:$E$64,IF(Sprache=\"Deutsch\",1,IF(Sprache=\"English\",2,IF(Sprache=\"Francais\",3,IF(Sprache=\"Italiano\",4,IF(Sprache=\"Portugues\",5,6))))),FALSE)","v":"Primärluftvolumenstrom"},{"$f":"Primärvolumenstrom","v":67},"m^3/h"]
[null,null,null,null,null,null,null,null,null,null,null,null,null,null,null,null,null,null,null,null,null,null,null,null,null,null,null,null,null,null,null,null,null,null,null,{"$f":"VLOOKUP(\"Wasservorlauftemperatur\",'Legende - Legend'!$B$5:$E$64,IF(Sprache=\"Deutsch\",1,IF(Sprache=\"English\",2,IF(Sprache=\"Francais\",3,IF(Sprache=\"Italiano\",4,IF(Sprache=\"Portugues\",5,6))))),FALSE)","v":"Wasservorlauftemperatur"},16,null,"°C",null,null,null,{"$f":"VLOOKUP(\"Wasservorlauftemperatur\",'Legende - Legend'!$B$5:$E$64,IF(Sprache=\"Deutsch\",1,IF(Sprache=\"English\",2,IF(Sprache=\"Francais\",3,IF(Sprache=\"Italiano\",4,IF(Sprache=\"Portugues\",5,6))))),FALSE)","v":"Wasservorlauftemperatur"},32,"°C"]
[null,null,null,null,null,null,null,null,null,null,null,null,null,null,null,null,null,null,null,null,null,null,null,null,null,null,null,null,null,null,null,null,null,null,null,{"$f":"VLOOKUP(\"Taupunkttemperatur\",'Legende - Legend'!$B$5:$E$64,IF(Sprache=\"Deutsch\",1,IF(Sprache=\"English\",2,IF(Sprache=\"Francais\",3,IF(Sprache=\"Italiano\",4,IF(Sprache=\"Portugues\",5,6))))),FALSE)","v":"Taupunkttemperatur"},{"$f":"(241.2*LN(AK12/100)+4222.03716*AK7/(241.2+AK7))/(17.5043-LN(AK12/100)-17.5043*AK7/(241.2+AK7))","v":14.771258916160397},null,"°C",null,null,null,null,null,null,null,null,null,null,null,null,null,null,null,null,null,null,null,null,null,null,null,null,null,null,null,null,null,null,null,null,null,null,null,null,null,null,null,null,null,"Date:",{"$f":"TODAY()","v":"2026-06-23"}]
[null,null,null,null,null,null,null,null,null,null,null,null,null,null,null,null,null,null,null,null,null,null,null,null,null,null,null,null,null,null,null,null,null,null,null,{"$f":"VLOOKUP(\"rel. Raumluftfeuchte\",'Legende - Legend'!$B$5:$E$64,IF(Sprache=\"Deutsch\",1,IF(Sprache=\"English\",2,IF(Sprache=\"Francais\",3,IF(Sprache=\"Italiano\",4,IF(Sprache=\"Portugues\",5,6))))),FALSE)","v":"rel. Raumluftfeuchte"},50,null,"%",null,null,null,null,null,null,null,null,null,null,null,null,null,null,null,null,null,null,null,null,null,null,null,null,null,null,null,null,null,null,null,null,null,null,null,null,null,null,null,null,null,"Name:"]
[null,null,null,null,null,null,null,null,null,null,null,null,null,null,null,null,null,null,null,null,null,null,null,null,null,null,null,null,null,null,null,null,null,null,null,{"$f":"VLOOKUP(\"projektierte Leistung\",'Legende - Legend'!$B$5:$E$64,IF(Sprache=\"Deutsch\",1,IF(Sprache=\"English\",2,IF(Sprache=\"Francais\",3,IF(Sprache=\"Italiano\",4,IF(Sprache=\"Portugues\",5,6))))),FALSE)","v":"projektierte Leistung"},200,null,"W",null,null,null,{"$f":"VLOOKUP(\"projektierte Leistung\",'Legende - Legend'!$B$5:$E$64,IF(Sprache=\"Deutsch\",1,IF(Sprache=\"English\",2,IF(Sprache=\"Francais\",3,IF(Sprache=\"Italiano\",4,IF(Sprache=\"Portugues\",5,6))))),FALSE)","v":"projektierte Leistung"},1200,"W"]
[]
[]
[]
[]
[]
[null,null,null,null,null,null,null,null,null,null,null,null,null,null,null,null,null,null,null,null,null,null,null,null,null,null,null,null,null,null,null,null,{"$f":"VLOOKUP(\"     Düsenbelegung anzeigen (Kunstoffdüsen)\",'Legende - Legend'!$B$5:$E$64,IF(Sprache=\"Deutsch\",1,IF(Sprache=\"English\",2,IF(Sprache=\"Francais\",3,IF(Sprache=\"Italiano\",4,IF(Sprache=\"Portugues\",5,6))))),FALSE)","v":"     Düsenbelegung anzeigen (Kunstoffdüsen)"},null,null,null,null,null,null,null,null,null,null,null,null,null,null,null,"((($E$39+273)*Vprim/3600+$T$30*Vprim/3600*($E$31+273)+H49/(1176,56+1,00692))/($T$30*Vprim/3600+Vprim/3600))-273"]
["Baugröße 500",null,null,null,null,null,null,null,null,"2 Leiter",null,"4 Leiter",null,null,null,"Umrechnung",null,"Umrechnung",null,null,null,null,null,null,null,null,null,null,null,{"$f":"VLOOKUP(\"Düsenbelegung (Kunstoffdüsen)\",'Legende - Legend'!$B$5:$E$64,IF(Sprache=\"Deutsch\",1,IF(Sprache=\"English\",2,IF(Sprache=\"Francais\",3,IF(Sprache=\"Italiano\",4,IF(Sprache=\"Portugues\",5,6))))),FALSE)","v":"Düsenbelegung (Kunstoffdüsen)"},null,{"$f":"VLOOKUP(\"Baugröße 500\",'Legende - Legend'!$B$5:$E$64,IF(Sprache=\"Deutsch\",1,IF(Sprache=\"English\",2,IF(Sprache=\"Francais\",3,IF(Sprache=\"Italiano\",4,IF(Sprache=\"Portugues\",5,6))))),FALSE)","v":"Baugröße 500"},null,null,null,null,null,null,null,null,null,null,null,null,null,null,null,"Baugröße 1000","Tausblass = (Tprim*Vprim+I*Vprim*Tansaug+Qsek(CPl*dichte)/(I*Vprim+Vprim)",null,null,null,null,null,null,"2-Leiter",null,"4-Leiter",null,null,null,null,null,null,null,null,null,null,null,null,null,null,null,null,null,{"$f":"VLOOKUP(\"Düsenbelegung (Kunstoffdüsen)\",'Legende - Legend'!$B$5:$E$64,IF(Sprache=\"Deutsch\",1,IF(Sprache=\"English\",2,IF(Sprache=\"Francais\",3,IF(Sprache=\"Italiano\",4,IF(Sprache=\"Portugues\",5,6))))),FALSE)","v":"Düsenbelegung (Kunstoffdüsen)"},null,{"$f":"VLOOKUP(\"Baugröße 1000\",'Legende - Legend'!$B$5:$E$64,IF(Sprache=\"Deutsch\",1,IF(Sprache=\"English\",2,IF(Sprache=\"Francais\",3,IF(Sprache=\"Italiano\",4,IF(Sprache=\"Portugues\",5,6))))),FALSE)","v":"Baugröße 1000"}]
{"$rows_left_out":61}
{"sheet":"Legende - Legend","index":1,"n_rows":74,"n_cols":5,"rows_kept":74,"cut":false,"hidden":true,"merged":[[73,0,73,16383],[0,4,0,5],[0,11,0,15],[70,0,70,3],[71,0,71,3],[72,0,72,3]]}
[]
[null,null,null,null,"LTG Aktiengesellschaft"]
[]
["Parameter","Legende","Legend ","Légende","Legenda"]
["-","Kühlfall","Cooling Mode","opération eau froide","In raffescamento"]
["-","Heizfall","Heating Mode","opération  eau chaude","In riscaldamento"]
["-","Ansaugtemperatur","Intake Air Temperature","Température de l'air ambiant","Temperatura aria in ingresso "]
["-","Wasservorlauftemperatur","Water Supply Temperature","Temperature de l'eau amenée","Temperatura acqua in ingresso  "]
["-","Baugröße","Size","Modèle","Taglia"]
["-","Nennwassermenge","Nominal Water Flow Rate","débit d'eau nominale","Portata acqua nominale "]
["-","Auswahl","Choice","Sélection","Scelta"]
["-","Kühlen","Cooling","Refroidissement","Raffrescamento"]
["-","Heizen ","Heating","Chauffer","Riscaldamento"]
["-","projektierte Leistung","Required Capacity","Objectif fixé","Potenzialità richiesta di progetto"]
["-","Beg. Kondensatbildung bei >","Event of condensation >","Condensation commence a"]
["-","Primärlufttemperatur","Primary Air Temperature","Témperature de l´air primaire","temperatura dell'aria "]
["-","Primärluftvolumenstrom","Primary Air flow","Debit de l´air primaire","portata d'airia"]
["-","rel. Raumluftfeuchte","Air humidity","hunidité rélatif","l’umidità relativa"]
["-","Baugröße 500","Size 500","taille 500","Taglia 500"]
["-","Baugröße 630","Size 630","Taille 630","Taglia 630"]
{"$rows_left_out":55}
{"sheet":"Tabelle1","index":2,"n_rows":0,"n_cols":0,"rows_kept":0,"cut":false,"hidden":true,"merged":[]}